Build error

classic Classic list List threaded Threaded
3 messages Options
Reply | Threaded
Open this post in threaded view
|

Build error

David Bolton-2
I'm getting a build error on Windows with the latest revision (1788).
Here's the last section of the log:


Scanning dependencies of target fluid
mingw32-make[3]: Leaving directory `C:/mscoreSVN/win32build'
mingw32-make[3]: Entering directory `C:/mscoreSVN/win32build'
[ 71%] Building CXX object fluid/CMakeFiles/fluid.dir/fluid.cpp.obj
In file included from C:\mscoreSVN\mscore\fluid\list.h:23,
                 from C:\mscoreSVN\mscore\fluid\fluid.h:26,
                 from C:\mscoreSVN\mscore\fluid\fluid.cpp:24:
C:\mscoreSVN\mscore\fluid\priv.h:23: error: `u_int8_t' does not name a type
C:\mscoreSVN\mscore\fluid\priv.h:25: error: `u_int16_t' does not name a type
C:\mscoreSVN\mscore\fluid\priv.h:27: error: `u_int32_t' does not name a type
C:\mscoreSVN\mscore\fluid\priv.h:29: error: `u_int64_t' does not name a type
In file included from C:\mscoreSVN\mscore\fluid\fluid.cpp:24:
C:\mscoreSVN\mscore\fluid\fluid.h:829: error: `uint32' does not name a type
C:\mscoreSVN\mscore\fluid\fluid.cpp: In member function `void
FluidS::Fluid::kil
l_by_exclusive_class(FluidS::Voice*)':
C:\mscoreSVN\mscore\fluid\fluid.cpp:1167: warning: converting to `int'
from `Flu
idS::fluid_real_t'
mingw32-make[3]: *** [fluid/CMakeFiles/fluid.dir/fluid.cpp.obj] Error 1
mingw32-make[3]: Leaving directory `C:/mscoreSVN/win32build'
mingw32-make[2]: *** [fluid/CMakeFiles/fluid.dir/all] Error 2
mingw32-make[2]: Leaving directory `C:/mscoreSVN/win32build'
mingw32-make[1]: *** [all] Error 2
mingw32-make[1]: Leaving directory `C:/mscoreSVN/win32build'
mingw32-make: *** [win32] Error 2

------------------------------------------------------------------------------
Register Now & Save for Velocity, the Web Performance & Operations
Conference from O'Reilly Media. Velocity features a full day of
expert-led, hands-on workshops and two days of sessions from industry
leaders in dedicated Performance & Operations tracks. Use code vel09scf
and Save an extra 15% before 5/3. http://p.sf.net/sfu/velocityconf
_______________________________________________
Mscore-developer mailing list
[hidden email]
https://lists.sourceforge.net/lists/listinfo/mscore-developer
Reply | Threaded
Open this post in threaded view
|

Re: Build error

wschweer
Administrator
This should be fixed in rev. 1790.

On Saturday 02 May 2009 19:21:15 David Bolton wrote:

> I'm getting a build error on Windows with the latest revision (1788).
> Here's the last section of the log:
>
>
> Scanning dependencies of target fluid
> mingw32-make[3]: Leaving directory `C:/mscoreSVN/win32build'
> mingw32-make[3]: Entering directory `C:/mscoreSVN/win32build'
> [ 71%] Building CXX object fluid/CMakeFiles/fluid.dir/fluid.cpp.obj
> In file included from C:\mscoreSVN\mscore\fluid\list.h:23,
>                  from C:\mscoreSVN\mscore\fluid\fluid.h:26,
>                  from C:\mscoreSVN\mscore\fluid\fluid.cpp:24:
> C:\mscoreSVN\mscore\fluid\priv.h:23: error: `u_int8_t' does not name a type
> C:\mscoreSVN\mscore\fluid\priv.h:25: error: `u_int16_t' does not name a
> type C:\mscoreSVN\mscore\fluid\priv.h:27: error: `u_int32_t' does not name
> a type C:\mscoreSVN\mscore\fluid\priv.h:29: error: `u_int64_t' does not
> name a type In file included from C:\mscoreSVN\mscore\fluid\fluid.cpp:24:
> C:\mscoreSVN\mscore\fluid\fluid.h:829: error: `uint32' does not name a type
> C:\mscoreSVN\mscore\fluid\fluid.cpp: In member function `void
> FluidS::Fluid::kil
> l_by_exclusive_class(FluidS::Voice*)':
> C:\mscoreSVN\mscore\fluid\fluid.cpp:1167: warning: converting to `int'
> from `Flu
> idS::fluid_real_t'
> mingw32-make[3]: *** [fluid/CMakeFiles/fluid.dir/fluid.cpp.obj] Error 1
> mingw32-make[3]: Leaving directory `C:/mscoreSVN/win32build'
> mingw32-make[2]: *** [fluid/CMakeFiles/fluid.dir/all] Error 2
> mingw32-make[2]: Leaving directory `C:/mscoreSVN/win32build'
> mingw32-make[1]: *** [all] Error 2
> mingw32-make[1]: Leaving directory `C:/mscoreSVN/win32build'
> mingw32-make: *** [win32] Error 2
>
> ---------------------------------------------------------------------------
>--- Register Now & Save for Velocity, the Web Performance & Operations
> Conference from O'Reilly Media. Velocity features a full day of
> expert-led, hands-on workshops and two days of sessions from industry
> leaders in dedicated Performance & Operations tracks. Use code vel09scf
> and Save an extra 15% before 5/3. http://p.sf.net/sfu/velocityconf
> _______________________________________________
> Mscore-developer mailing list
> [hidden email]
> https://lists.sourceforge.net/lists/listinfo/mscore-developer


------------------------------------------------------------------------------
Register Now & Save for Velocity, the Web Performance & Operations
Conference from O'Reilly Media. Velocity features a full day of
expert-led, hands-on workshops and two days of sessions from industry
leaders in dedicated Performance & Operations tracks. Use code vel09scf
and Save an extra 15% before 5/3. http://p.sf.net/sfu/velocityconf
_______________________________________________
Mscore-developer mailing list
[hidden email]
https://lists.sourceforge.net/lists/listinfo/mscore-developer
Reply | Threaded
Open this post in threaded view
|

Re: Build error

jmvr
I still get this error (as of rev. 1896) on linux x86-64 gcc-4.4.0.

I "fixed" it by adding the following patch to priv.h

3a4,5
> #include <stdint.h>
>

wschweer wrote
This should be fixed in rev. 1790.

On Saturday 02 May 2009 19:21:15 David Bolton wrote:
> I'm getting a build error on Windows with the latest revision (1788).
> Here's the last section of the log:
>
>
> Scanning dependencies of target fluid
> mingw32-make[3]: Leaving directory `C:/mscoreSVN/win32build'
> mingw32-make[3]: Entering directory `C:/mscoreSVN/win32build'
> [ 71%] Building CXX object fluid/CMakeFiles/fluid.dir/fluid.cpp.obj
> In file included from C:\mscoreSVN\mscore\fluid\list.h:23,
>                  from C:\mscoreSVN\mscore\fluid\fluid.h:26,
>                  from C:\mscoreSVN\mscore\fluid\fluid.cpp:24:
> C:\mscoreSVN\mscore\fluid\priv.h:23: error: `u_int8_t' does not name a type
> C:\mscoreSVN\mscore\fluid\priv.h:25: error: `u_int16_t' does not name a
> type C:\mscoreSVN\mscore\fluid\priv.h:27: error: `u_int32_t' does not name
> a type C:\mscoreSVN\mscore\fluid\priv.h:29: error: `u_int64_t' does not
> name a type In file included from C:\mscoreSVN\mscore\fluid\fluid.cpp:24:
> C:\mscoreSVN\mscore\fluid\fluid.h:829: error: `uint32' does not name a type
> C:\mscoreSVN\mscore\fluid\fluid.cpp: In member function `void
> FluidS::Fluid::kil
> l_by_exclusive_class(FluidS::Voice*)':
> C:\mscoreSVN\mscore\fluid\fluid.cpp:1167: warning: converting to `int'
> from `Flu
> idS::fluid_real_t'
> mingw32-make[3]: *** [fluid/CMakeFiles/fluid.dir/fluid.cpp.obj] Error 1
> mingw32-make[3]: Leaving directory `C:/mscoreSVN/win32build'
> mingw32-make[2]: *** [fluid/CMakeFiles/fluid.dir/all] Error 2
> mingw32-make[2]: Leaving directory `C:/mscoreSVN/win32build'
> mingw32-make[1]: *** [all] Error 2
> mingw32-make[1]: Leaving directory `C:/mscoreSVN/win32build'
> mingw32-make: *** [win32] Error 2
>
> ---------------------------------------------------------------------------
>--- Register Now & Save for Velocity, the Web Performance & Operations
> Conference from O'Reilly Media. Velocity features a full day of
> expert-led, hands-on workshops and two days of sessions from industry
> leaders in dedicated Performance & Operations tracks. Use code vel09scf
> and Save an extra 15% before 5/3. http://p.sf.net/sfu/velocityconf
> _______________________________________________
> Mscore-developer mailing list
> Mscore-developer@lists.sourceforge.net
> https://lists.sourceforge.net/lists/listinfo/mscore-developer


------------------------------------------------------------------------------
Register Now & Save for Velocity, the Web Performance & Operations
Conference from O'Reilly Media. Velocity features a full day of
expert-led, hands-on workshops and two days of sessions from industry
leaders in dedicated Performance & Operations tracks. Use code vel09scf
and Save an extra 15% before 5/3. http://p.sf.net/sfu/velocityconf
_______________________________________________
Mscore-developer mailing list
Mscore-developer@lists.sourceforge.net
https://lists.sourceforge.net/lists/listinfo/mscore-developer