Quantcast

Build error

classic Classic list List threaded Threaded
4 messages Options
Reply | Threaded
Open this post in threaded view
|  
Report Content as Inappropriate

Build error

David Bolton-2
I'm getting a build error on r2214. I built r.2205 successfully
yesterday. I wasn't able to find the cause of the problem.

mingw32-make[3]: Entering directory `E:/m/win32build'
[ 70%] Building CXX object mscore/CMakeFiles/mscore.dir/qrc_mscore.cxx.obj
[ 70%] Building CXX object
mscore/CMakeFiles/mscore.dir/moc_inspector.cxx.obj
[ 71%] Building CXX object mscore/CMakeFiles/mscore.dir/moc_score.cxx.obj
[ 71%] Building CXX object mscore/CMakeFiles/mscore.dir/moc_seq.cxx.obj
[ 71%] Building CXX object
mscore/CMakeFiles/mscore.dir/moc_stafftext.cxx.obj
[ 71%] Building CXX object mscore/CMakeFiles/mscore.dir/moc_script.cxx.obj
[ 71%] Building CXX object mscore/CMakeFiles/mscore.dir/moc_scscore.cxx.obj
E:\m\win32build\mscore\moc_scscore.cxx: In member function `virtual int
ScScoreP
rototype::qt_metacall(QMetaObject::Call, int, void**)':
E:\m\win32build\mscore\moc_scscore.cxx:117: error: `saveWav' was not
declared in
 this scope
E:\m\win32build\mscore\moc_scscore.cxx:117: warning: unused variable
'saveWav'
E:\m\win32build\mscore\moc_scscore.cxx:119: error: `saveWav' was not
declared in
 this scope
E:\m\win32build\mscore\moc_scscore.cxx:119: warning: unused variable
'saveWav'
E:\m\win32build\mscore\moc_scscore.cxx:121: error: `saveFlac' was not
declared i
n this scope
E:\m\win32build\mscore\moc_scscore.cxx:121: warning: unused variable
'saveFlac'
E:\m\win32build\mscore\moc_scscore.cxx:123: error: `saveFlac' was not
declared i
n this scope
E:\m\win32build\mscore\moc_scscore.cxx:123: warning: unused variable
'saveFlac'
E:\m\win32build\mscore\moc_scscore.cxx:125: error: `saveOgg' was not
declared in
 this scope
E:\m\win32build\mscore\moc_scscore.cxx:125: warning: unused variable
'saveOgg'
E:\m\win32build\mscore\moc_scscore.cxx:127: error: `saveOgg' was not
declared in
 this scope
E:\m\win32build\mscore\moc_scscore.cxx:127: warning: unused variable
'saveOgg'
mingw32-make[3]: *** [mscore/CMakeFiles/mscore.dir/moc_scscore.cxx.obj]
Error 1
mingw32-make[3]: Leaving directory `E:/m/win32build'
mingw32-make[2]: *** [mscore/CMakeFiles/mscore.dir/all] Error 2
mingw32-make[2]: Leaving directory `E:/m/win32build'
mingw32-make[1]: *** [all] Error 2
mingw32-make[1]: Leaving directory `E:/m/win32build'
mingw32-make: *** [win32] Error 2

------------------------------------------------------------------------------
Come build with us! The BlackBerry(R) Developer Conference in SF, CA
is the only developer event you need to attend this year. Jumpstart your
developing skills, take BlackBerry mobile applications to market and stay
ahead of the curve. Join us from November 9 - 12, 2009. Register now!
http://p.sf.net/sfu/devconference
_______________________________________________
Mscore-developer mailing list
[hidden email]
https://lists.sourceforge.net/lists/listinfo/mscore-developer
Reply | Threaded
Open this post in threaded view
|  
Report Content as Inappropriate

Re: Build error

lasconic
Administrator
Werner commited twice the root CMakeFiles.txt with HAS_AUDIOFILE to FALSE. I revert this change between the two commits.
Did you change this in the SVN on purpose?


Lasconic

2009/10/17 David Bolton <[hidden email]>
I'm getting a build error on r2214. I built r.2205 successfully
yesterday. I wasn't able to find the cause of the problem.

mingw32-make[3]: Entering directory `E:/m/win32build'
[ 70%] Building CXX object mscore/CMakeFiles/mscore.dir/qrc_mscore.cxx.obj
[ 70%] Building CXX object
mscore/CMakeFiles/mscore.dir/moc_inspector.cxx.obj
[ 71%] Building CXX object mscore/CMakeFiles/mscore.dir/moc_score.cxx.obj
[ 71%] Building CXX object mscore/CMakeFiles/mscore.dir/moc_seq.cxx.obj
[ 71%] Building CXX object
mscore/CMakeFiles/mscore.dir/moc_stafftext.cxx.obj
[ 71%] Building CXX object mscore/CMakeFiles/mscore.dir/moc_script.cxx.obj
[ 71%] Building CXX object mscore/CMakeFiles/mscore.dir/moc_scscore.cxx.obj
E:\m\win32build\mscore\moc_scscore.cxx: In member function `virtual int
ScScoreP
rototype::qt_metacall(QMetaObject::Call, int, void**)':
E:\m\win32build\mscore\moc_scscore.cxx:117: error: `saveWav' was not
declared in
 this scope
E:\m\win32build\mscore\moc_scscore.cxx:117: warning: unused variable
'saveWav'
E:\m\win32build\mscore\moc_scscore.cxx:119: error: `saveWav' was not
declared in
 this scope
E:\m\win32build\mscore\moc_scscore.cxx:119: warning: unused variable
'saveWav'
E:\m\win32build\mscore\moc_scscore.cxx:121: error: `saveFlac' was not
declared i
n this scope
E:\m\win32build\mscore\moc_scscore.cxx:121: warning: unused variable
'saveFlac'
E:\m\win32build\mscore\moc_scscore.cxx:123: error: `saveFlac' was not
declared i
n this scope
E:\m\win32build\mscore\moc_scscore.cxx:123: warning: unused variable
'saveFlac'
E:\m\win32build\mscore\moc_scscore.cxx:125: error: `saveOgg' was not
declared in
 this scope
E:\m\win32build\mscore\moc_scscore.cxx:125: warning: unused variable
'saveOgg'
E:\m\win32build\mscore\moc_scscore.cxx:127: error: `saveOgg' was not
declared in
 this scope
E:\m\win32build\mscore\moc_scscore.cxx:127: warning: unused variable
'saveOgg'
mingw32-make[3]: *** [mscore/CMakeFiles/mscore.dir/moc_scscore.cxx.obj]
Error 1
mingw32-make[3]: Leaving directory `E:/m/win32build'
mingw32-make[2]: *** [mscore/CMakeFiles/mscore.dir/all] Error 2
mingw32-make[2]: Leaving directory `E:/m/win32build'
mingw32-make[1]: *** [all] Error 2
mingw32-make[1]: Leaving directory `E:/m/win32build'
mingw32-make: *** [win32] Error 2

------------------------------------------------------------------------------
Come build with us! The BlackBerry(R) Developer Conference in SF, CA
is the only developer event you need to attend this year. Jumpstart your
developing skills, take BlackBerry mobile applications to market and stay
ahead of the curve. Join us from November 9 - 12, 2009. Register now!
http://p.sf.net/sfu/devconference
_______________________________________________
Mscore-developer mailing list
[hidden email]
https://lists.sourceforge.net/lists/listinfo/mscore-developer


------------------------------------------------------------------------------
Come build with us! The BlackBerry(R) Developer Conference in SF, CA
is the only developer event you need to attend this year. Jumpstart your
developing skills, take BlackBerry mobile applications to market and stay
ahead of the curve. Join us from November 9 - 12, 2009. Register now!
http://p.sf.net/sfu/devconference
_______________________________________________
Mscore-developer mailing list
[hidden email]
https://lists.sourceforge.net/lists/listinfo/mscore-developer
Reply | Threaded
Open this post in threaded view
|  
Report Content as Inappropriate

Re: Build error

wschweer
Administrator
In reply to this post by David Bolton-2
Accidently i commited a CMakeLists.txt file with the variable "HAS_AUDIFILE"
set to "false". Its "true" again in rev. 2216. Please try compiling with this
latest version.
 
Am Samstag 17 Oktober 2009 12:24:40 schrieb David Bolton:

> I'm getting a build error on r2214. I built r.2205 successfully
> yesterday. I wasn't able to find the cause of the problem.
>
> mingw32-make[3]: Entering directory `E:/m/win32build'
> [ 70%] Building CXX object mscore/CMakeFiles/mscore.dir/qrc_mscore.cxx.obj
> [ 70%] Building CXX object
> mscore/CMakeFiles/mscore.dir/moc_inspector.cxx.obj
> [ 71%] Building CXX object mscore/CMakeFiles/mscore.dir/moc_score.cxx.obj
> [ 71%] Building CXX object mscore/CMakeFiles/mscore.dir/moc_seq.cxx.obj
> [ 71%] Building CXX object
> mscore/CMakeFiles/mscore.dir/moc_stafftext.cxx.obj
> [ 71%] Building CXX object mscore/CMakeFiles/mscore.dir/moc_script.cxx.obj
> [ 71%] Building CXX object mscore/CMakeFiles/mscore.dir/moc_scscore.cxx.obj
> E:\m\win32build\mscore\moc_scscore.cxx: In member function `virtual int
> ScScoreP
> rototype::qt_metacall(QMetaObject::Call, int, void**)':
> E:\m\win32build\mscore\moc_scscore.cxx:117: error: `saveWav' was not
> declared in
>  this scope
> E:\m\win32build\mscore\moc_scscore.cxx:117: warning: unused variable
> 'saveWav'
> E:\m\win32build\mscore\moc_scscore.cxx:119: error: `saveWav' was not
> declared in
>  this scope
> E:\m\win32build\mscore\moc_scscore.cxx:119: warning: unused variable
> 'saveWav'
> E:\m\win32build\mscore\moc_scscore.cxx:121: error: `saveFlac' was not
> declared i
> n this scope
> E:\m\win32build\mscore\moc_scscore.cxx:121: warning: unused variable
> 'saveFlac'
> E:\m\win32build\mscore\moc_scscore.cxx:123: error: `saveFlac' was not
> declared i
> n this scope
> E:\m\win32build\mscore\moc_scscore.cxx:123: warning: unused variable
> 'saveFlac'
> E:\m\win32build\mscore\moc_scscore.cxx:125: error: `saveOgg' was not
> declared in
>  this scope
> E:\m\win32build\mscore\moc_scscore.cxx:125: warning: unused variable
> 'saveOgg'
> E:\m\win32build\mscore\moc_scscore.cxx:127: error: `saveOgg' was not
> declared in
>  this scope
> E:\m\win32build\mscore\moc_scscore.cxx:127: warning: unused variable
> 'saveOgg'
> mingw32-make[3]: *** [mscore/CMakeFiles/mscore.dir/moc_scscore.cxx.obj]
> Error 1
> mingw32-make[3]: Leaving directory `E:/m/win32build'
> mingw32-make[2]: *** [mscore/CMakeFiles/mscore.dir/all] Error 2
> mingw32-make[2]: Leaving directory `E:/m/win32build'
> mingw32-make[1]: *** [all] Error 2
> mingw32-make[1]: Leaving directory `E:/m/win32build'
> mingw32-make: *** [win32] Error 2
>
> ---------------------------------------------------------------------------
> --- Come build with us! The BlackBerry(R) Developer Conference in SF, CA is
>  the only developer event you need to attend this year. Jumpstart your
>  developing skills, take BlackBerry mobile applications to market and stay
>  ahead of the curve. Join us from November 9 - 12, 2009. Register now!
>  http://p.sf.net/sfu/devconference
> _______________________________________________
> Mscore-developer mailing list
> [hidden email]
> https://lists.sourceforge.net/lists/listinfo/mscore-developer
>

------------------------------------------------------------------------------
Come build with us! The BlackBerry(R) Developer Conference in SF, CA
is the only developer event you need to attend this year. Jumpstart your
developing skills, take BlackBerry mobile applications to market and stay
ahead of the curve. Join us from November 9 - 12, 2009. Register now!
http://p.sf.net/sfu/devconference
_______________________________________________
Mscore-developer mailing list
[hidden email]
https://lists.sourceforge.net/lists/listinfo/mscore-developer
Reply | Threaded
Open this post in threaded view
|  
Report Content as Inappropriate

Re: Build error

wschweer
Administrator
In reply to this post by lasconic
Sorry, i was working on a computer with an old libsndfile installed and
changed the build variable temporarily. It was committed by accident.
 
Am Samstag 17 Oktober 2009 13:07:43 schrieb Lasconic:

> Werner commited twice the root CMakeFiles.txt with HAS_AUDIOFILE to FALSE.
>  I revert this change between the two commits.
> Did you change this in the SVN on purpose?
>
>
> Lasconic
>
> 2009/10/17 David Bolton <[hidden email]>
>
> > I'm getting a build error on r2214. I built r.2205 successfully
> > yesterday. I wasn't able to find the cause of the problem.
> >
> > mingw32-make[3]: Entering directory `E:/m/win32build'
> > [ 70%] Building CXX object
> > mscore/CMakeFiles/mscore.dir/qrc_mscore.cxx.obj [ 70%] Building CXX
> > object
> > mscore/CMakeFiles/mscore.dir/moc_inspector.cxx.obj
> > [ 71%] Building CXX object mscore/CMakeFiles/mscore.dir/moc_score.cxx.obj
> > [ 71%] Building CXX object mscore/CMakeFiles/mscore.dir/moc_seq.cxx.obj
> > [ 71%] Building CXX object
> > mscore/CMakeFiles/mscore.dir/moc_stafftext.cxx.obj
> > [ 71%] Building CXX object
> > mscore/CMakeFiles/mscore.dir/moc_script.cxx.obj [ 71%] Building CXX
> > object mscore/CMakeFiles/mscore.dir/moc_scscore.cxx.obj
> > E:\m\win32build\mscore\moc_scscore.cxx: In member function `virtual int
> > ScScoreP
> > rototype::qt_metacall(QMetaObject::Call, int, void**)':
> > E:\m\win32build\mscore\moc_scscore.cxx:117: error: `saveWav' was not
> > declared in
> >  this scope
> > E:\m\win32build\mscore\moc_scscore.cxx:117: warning: unused variable
> > 'saveWav'
> > E:\m\win32build\mscore\moc_scscore.cxx:119: error: `saveWav' was not
> > declared in
> >  this scope
> > E:\m\win32build\mscore\moc_scscore.cxx:119: warning: unused variable
> > 'saveWav'
> > E:\m\win32build\mscore\moc_scscore.cxx:121: error: `saveFlac' was not
> > declared i
> > n this scope
> > E:\m\win32build\mscore\moc_scscore.cxx:121: warning: unused variable
> > 'saveFlac'
> > E:\m\win32build\mscore\moc_scscore.cxx:123: error: `saveFlac' was not
> > declared i
> > n this scope
> > E:\m\win32build\mscore\moc_scscore.cxx:123: warning: unused variable
> > 'saveFlac'
> > E:\m\win32build\mscore\moc_scscore.cxx:125: error: `saveOgg' was not
> > declared in
> >  this scope
> > E:\m\win32build\mscore\moc_scscore.cxx:125: warning: unused variable
> > 'saveOgg'
> > E:\m\win32build\mscore\moc_scscore.cxx:127: error: `saveOgg' was not
> > declared in
> >  this scope
> > E:\m\win32build\mscore\moc_scscore.cxx:127: warning: unused variable
> > 'saveOgg'
> > mingw32-make[3]: *** [mscore/CMakeFiles/mscore.dir/moc_scscore.cxx.obj]
> > Error 1
> > mingw32-make[3]: Leaving directory `E:/m/win32build'
> > mingw32-make[2]: *** [mscore/CMakeFiles/mscore.dir/all] Error 2
> > mingw32-make[2]: Leaving directory `E:/m/win32build'
> > mingw32-make[1]: *** [all] Error 2
> > mingw32-make[1]: Leaving directory `E:/m/win32build'
> > mingw32-make: *** [win32] Error 2
> >
> >
> > -------------------------------------------------------------------------
> >----- Come build with us! The BlackBerry(R) Developer Conference in SF, CA
> > is the only developer event you need to attend this year. Jumpstart your
> > developing skills, take BlackBerry mobile applications to market and stay
> > ahead of the curve. Join us from November 9 - 12, 2009. Register now!
> > http://p.sf.net/sfu/devconference
> > _______________________________________________
> > Mscore-developer mailing list
> > [hidden email]
> > https://lists.sourceforge.net/lists/listinfo/mscore-developer
>

------------------------------------------------------------------------------
Come build with us! The BlackBerry(R) Developer Conference in SF, CA
is the only developer event you need to attend this year. Jumpstart your
developing skills, take BlackBerry mobile applications to market and stay
ahead of the curve. Join us from November 9 - 12, 2009. Register now!
http://p.sf.net/sfu/devconference
_______________________________________________
Mscore-developer mailing list
[hidden email]
https://lists.sourceforge.net/lists/listinfo/mscore-developer
Loading...