MBP osx 10.10 BUILD FAILED

classic Classic list List threaded Threaded
2 messages Options
Reply | Threaded
Open this post in threaded view
|

MBP osx 10.10 BUILD FAILED

joambi
This post has NOT been accepted by the mailing list yet.
Last login: Mon Feb  2 11:32:42 on ttys000
ssmn-build:~ build$ source ~/.profile
ssmn-build:~ build$ git clone git://github.com/musescore/MuseScore.git
fatal: destination path 'MuseScore' already exists and is not an empty directory.
ssmn-build:~ build$ git clone git://github.com/musescore/MuseScore.git
Cloning into 'MuseScore'...
remote: Counting objects: 62540, done.
remote: Compressing objects: 100% (14/14), done.
remote: Total 62540 (delta 2), reused 0 (delta 0)
Receiving objects: 100% (62540/62540), 161.76 MiB | 3.27 MiB/s, done.
Resolving deltas: 100% (50171/50171), done.
Checking connectivity... done.
ssmn-build:~ build$ cd MuseScore
ssmn-build:MuseScore build$ make revision
ssmn-build:MuseScore build$ make -f Makefile.osx release
mkdir build.release;                               \
    cd build.release;                                  \
    cmake -DCMAKE_INSTALL_PREFIX="../applebuild" -DCMAKE_BUILD_TYPE=RELEASE \
          .. -G Xcode;       \
    xcodebuild -project mscore.xcodeproj -target lrelease;                             \
        xcodebuild -project mscore.xcodeproj -configuration Release -target ALL_BUILD;     \

-- The C compiler identification is AppleClang 6.0.0.6000056
-- The CXX compiler identification is AppleClang 6.0.0.6000056
-- Check for working C compiler using: Xcode
-- Check for working C compiler using: Xcode -- works
-- Detecting C compiler ABI info
-- Detecting C compiler ABI info - done
-- Check for working CXX compiler using: Xcode
-- Check for working CXX compiler using: Xcode -- works
-- Detecting CXX compiler ABI info
-- Detecting CXX compiler ABI info - done
-- Could NOT find Doxygen (missing:  DOXYGEN_EXECUTABLE)
Doxygen not found
-- Found PkgConfig: /usr/local/bin/pkg-config (found version "0.28")
-- checking for module 'libpulse'
--   package 'libpulse' not found
-- Found lame: /usr/local/Cellar/lame/3.99.5/lib/libmp3lame.dylib
Disabling ALSA support due to OS X or MINGW build.
-- jack (jack audio connection kit) >= 0.98.0 found
portaudio detected /usr/local/Cellar/portaudio/19.20140130/include /usr/local/Cellar/portaudio/19.20140130/lib -L/usr/local/Cellar/portaudio/19.20140130/lib -lportaudio -framework CoreAudio -framework AudioToolbox -framework AudioUnit -framework Carbon
libvorbis detected /usr/local/Cellar/libvorbis/1.3.4/include /usr/local/Cellar/libvorbis/1.3.4/lib -L/usr/local/Cellar/libvorbis/1.3.4/lib -lvorbis
libogg detected /usr/local/Cellar/libogg/1.3.2/include /usr/local/Cellar/libogg/1.3.2/lib -L/usr/local/Cellar/libogg/1.3.2/lib -logg
libsndfile detected /usr/local/Cellar/libsndfile/1.0.25/include /usr/local/Cellar/libsndfile/1.0.25/lib -L/usr/local/Cellar/libsndfile/1.0.25/lib -lsndfile
-- Configuring done
CMake Warning (dev) at mscore/CMakeLists.txt:540 (ADD_DEPENDENCIES):
  Policy CMP0046 is not set: Error on non-existent dependency in
  add_dependencies.  Run "cmake --help-policy CMP0046" for policy details.
  Use the cmake_policy command to set the policy and suppress this warning.

  The dependency target "MACOSX_BUNDLE" of target "mscore" does not exist.
This warning is for project developers.  Use -Wno-dev to suppress it.

CMake Warning (dev):
  Policy CMP0042 is not set: MACOSX_RPATH is enabled by default.  Run "cmake
  --help-policy CMP0042" for policy details.  Use the cmake_policy command to
  set the policy and suppress this warning.

  MACOSX_RPATH is not specified for the following targets:

   awlplugin

This warning is for project developers.  Use -Wno-dev to suppress it.

-- Generating done
-- Build files have been written to: /Users/build/MuseScore/build.release
=== BUILD AGGREGATE TARGET ZERO_CHECK OF PROJECT mscore WITH THE DEFAULT CONFIGURATION (Debug) ===

Check dependencies

Write auxiliary files
/bin/mkdir -p /Users/build/MuseScore/build.release/mscore.build/Debug/ZERO_CHECK.build
write-file /Users/build/MuseScore/build.release/mscore.build/Debug/ZERO_CHECK.build/Script-FC6ED9DF099A46F893B2550D.sh
chmod 0755 /Users/build/MuseScore/build.release/mscore.build/Debug/ZERO_CHECK.build/Script-FC6ED9DF099A46F893B2550D.sh

PhaseScriptExecution CMake\ Rules build.release/mscore.build/Debug/ZERO_CHECK.build/Script-FC6ED9DF099A46F893B2550D.sh
    cd /Users/build/MuseScore
    /bin/sh -c /Users/build/MuseScore/build.release/mscore.build/Debug/ZERO_CHECK.build/Script-FC6ED9DF099A46F893B2550D.sh
echo ""

make -f /Users/build/MuseScore/build.release/CMakeScripts/ReRunCMake.make
make[2]: `/Users/build/MuseScore/build.release/CMakeFiles/cmake.check_cache' is up to date.

=== BUILD AGGREGATE TARGET lrelease OF PROJECT mscore WITH THE DEFAULT CONFIGURATION (Debug) ===

Check dependencies

Write auxiliary files
/bin/mkdir -p /Users/build/MuseScore/build.release/mscore.build/Debug/lrelease.build
write-file /Users/build/MuseScore/build.release/mscore.build/Debug/lrelease.build/Script-89A138BCEF27480C959944A8.sh
chmod 0755 /Users/build/MuseScore/build.release/mscore.build/Debug/lrelease.build/Script-89A138BCEF27480C959944A8.sh

PhaseScriptExecution CMake\ Rules build.release/mscore.build/Debug/lrelease.build/Script-89A138BCEF27480C959944A8.sh
    cd /Users/build/MuseScore
    /bin/sh -c /Users/build/MuseScore/build.release/mscore.build/Debug/lrelease.build/Script-89A138BCEF27480C959944A8.sh
echo ""

cd /Users/build/MuseScore/build.release && /Users/build/MuseScore/build/gen-qt-projectfile /Users/build/MuseScore > mscore.pro
cd /Users/build/MuseScore/build.release && /Users/build/MuseScore/build/gen-qt-projectfile /Users/build/MuseScore/share/instruments > instruments.pro
cd /Users/build/MuseScore/build.release && /Users/build/Qt/5.4/clang_64/bin/lrelease /Users/build/MuseScore/share/locale/*.ts
Updating '/Users/build/MuseScore/share/locale/instruments_af.qm'...
    2 Übersetzungen wurden erzeugt (2 abgeschlossen und 0 nicht abgeschlossen)
    925 nicht übersetzte Texte wurden ignoriert
Updating '/Users/build/MuseScore/share/locale/instruments_ar.qm'...
    Eine Übersetzung wurde erzeugt (1 abgeschlossen und 0 nicht abgeschlossen)
    926 nicht übersetzte Texte wurden ignoriert
Updating '/Users/build/MuseScore/share/locale/instruments_ast.qm'...
    4 Übersetzungen wurden erzeugt (4 abgeschlossen und 0 nicht abgeschlossen)
    923 nicht übersetzte Texte wurden ignoriert
Updating '/Users/build/MuseScore/share/locale/instruments_be.qm'...
    0 Übersetzungen wurden erzeugt (0 abgeschlossen und 0 nicht abgeschlossen)
    927 nicht übersetzte Texte wurden ignoriert
Updating '/Users/build/MuseScore/share/locale/instruments_bg.qm'...
    3 Übersetzungen wurden erzeugt (3 abgeschlossen und 0 nicht abgeschlossen)
    924 nicht übersetzte Texte wurden ignoriert
Updating '/Users/build/MuseScore/share/locale/instruments_ca.qm'...
    38 Übersetzungen wurden erzeugt (38 abgeschlossen und 0 nicht abgeschlossen)
    889 nicht übersetzte Texte wurden ignoriert
Updating '/Users/build/MuseScore/share/locale/instruments_ca@valencia.qm'...
    367 Übersetzungen wurden erzeugt (367 abgeschlossen und 0 nicht abgeschlossen)
    560 nicht übersetzte Texte wurden ignoriert
Updating '/Users/build/MuseScore/share/locale/instruments_cs.qm'...
    927 Übersetzungen wurden erzeugt (927 abgeschlossen und 0 nicht abgeschlossen)
Updating '/Users/build/MuseScore/share/locale/instruments_da.qm'...
    42 Übersetzungen wurden erzeugt (42 abgeschlossen und 0 nicht abgeschlossen)
    885 nicht übersetzte Texte wurden ignoriert
Updating '/Users/build/MuseScore/share/locale/instruments_de.qm'...
    927 Übersetzungen wurden erzeugt (927 abgeschlossen und 0 nicht abgeschlossen)
Updating '/Users/build/MuseScore/share/locale/instruments_el.qm'...
    322 Übersetzungen wurden erzeugt (322 abgeschlossen und 0 nicht abgeschlossen)
    605 nicht übersetzte Texte wurden ignoriert
Updating '/Users/build/MuseScore/share/locale/instruments_en_GB.qm'...
    927 Übersetzungen wurden erzeugt (927 abgeschlossen und 0 nicht abgeschlossen)
Updating '/Users/build/MuseScore/share/locale/instruments_en_US.qm'...
    0 Übersetzungen wurden erzeugt (0 abgeschlossen und 0 nicht abgeschlossen)
    927 nicht übersetzte Texte wurden ignoriert
Updating '/Users/build/MuseScore/share/locale/instruments_eo.qm'...
    195 Übersetzungen wurden erzeugt (195 abgeschlossen und 0 nicht abgeschlossen)
    732 nicht übersetzte Texte wurden ignoriert
Updating '/Users/build/MuseScore/share/locale/instruments_es.qm'...
    230 Übersetzungen wurden erzeugt (230 abgeschlossen und 0 nicht abgeschlossen)
    697 nicht übersetzte Texte wurden ignoriert
Updating '/Users/build/MuseScore/share/locale/instruments_et.qm'...
    2 Übersetzungen wurden erzeugt (2 abgeschlossen und 0 nicht abgeschlossen)
    925 nicht übersetzte Texte wurden ignoriert
Updating '/Users/build/MuseScore/share/locale/instruments_eu.qm'...
    4 Übersetzungen wurden erzeugt (4 abgeschlossen und 0 nicht abgeschlossen)
    923 nicht übersetzte Texte wurden ignoriert
Updating '/Users/build/MuseScore/share/locale/instruments_fa.qm'...
    17 Übersetzungen wurden erzeugt (17 abgeschlossen und 0 nicht abgeschlossen)
    910 nicht übersetzte Texte wurden ignoriert
Updating '/Users/build/MuseScore/share/locale/instruments_fi.qm'...
    4 Übersetzungen wurden erzeugt (4 abgeschlossen und 0 nicht abgeschlossen)
    923 nicht übersetzte Texte wurden ignoriert
Updating '/Users/build/MuseScore/share/locale/instruments_fo.qm'...
    4 Übersetzungen wurden erzeugt (4 abgeschlossen und 0 nicht abgeschlossen)
    923 nicht übersetzte Texte wurden ignoriert
Updating '/Users/build/MuseScore/share/locale/instruments_fr.qm'...
    428 Übersetzungen wurden erzeugt (428 abgeschlossen und 0 nicht abgeschlossen)
    499 nicht übersetzte Texte wurden ignoriert
Updating '/Users/build/MuseScore/share/locale/instruments_gl.qm'...
    912 Übersetzungen wurden erzeugt (912 abgeschlossen und 0 nicht abgeschlossen)
    15 nicht übersetzte Texte wurden ignoriert
Updating '/Users/build/MuseScore/share/locale/instruments_he.qm'...
    2 Übersetzungen wurden erzeugt (2 abgeschlossen und 0 nicht abgeschlossen)
    925 nicht übersetzte Texte wurden ignoriert
Updating '/Users/build/MuseScore/share/locale/instruments_hi_IN.qm'...
    0 Übersetzungen wurden erzeugt (0 abgeschlossen und 0 nicht abgeschlossen)
    927 nicht übersetzte Texte wurden ignoriert
Updating '/Users/build/MuseScore/share/locale/instruments_hr.qm'...
    4 Übersetzungen wurden erzeugt (4 abgeschlossen und 0 nicht abgeschlossen)
    923 nicht übersetzte Texte wurden ignoriert
Updating '/Users/build/MuseScore/share/locale/instruments_hu.qm'...
    80 Übersetzungen wurden erzeugt (80 abgeschlossen und 0 nicht abgeschlossen)
    847 nicht übersetzte Texte wurden ignoriert
Updating '/Users/build/MuseScore/share/locale/instruments_id.qm'...
    0 Übersetzungen wurden erzeugt (0 abgeschlossen und 0 nicht abgeschlossen)
    927 nicht übersetzte Texte wurden ignoriert
Updating '/Users/build/MuseScore/share/locale/instruments_it.qm'...
    927 Übersetzungen wurden erzeugt (927 abgeschlossen und 0 nicht abgeschlossen)
Updating '/Users/build/MuseScore/share/locale/instruments_ja.qm'...
    927 Übersetzungen wurden erzeugt (927 abgeschlossen und 0 nicht abgeschlossen)
Updating '/Users/build/MuseScore/share/locale/instruments_ka.qm'...
    Eine Übersetzung wurde erzeugt (1 abgeschlossen und 0 nicht abgeschlossen)
    926 nicht übersetzte Texte wurden ignoriert
Updating '/Users/build/MuseScore/share/locale/instruments_ko.qm'...
    Eine Übersetzung wurde erzeugt (1 abgeschlossen und 0 nicht abgeschlossen)
    926 nicht übersetzte Texte wurden ignoriert
Updating '/Users/build/MuseScore/share/locale/instruments_lt.qm'...
    4 Übersetzungen wurden erzeugt (4 abgeschlossen und 0 nicht abgeschlossen)
    923 nicht übersetzte Texte wurden ignoriert
Updating '/Users/build/MuseScore/share/locale/instruments_mn_MN.qm'...
    0 Übersetzungen wurden erzeugt (0 abgeschlossen und 0 nicht abgeschlossen)
    927 nicht übersetzte Texte wurden ignoriert
Updating '/Users/build/MuseScore/share/locale/instruments_nb.qm'...
    4 Übersetzungen wurden erzeugt (4 abgeschlossen und 0 nicht abgeschlossen)
    923 nicht übersetzte Texte wurden ignoriert
Updating '/Users/build/MuseScore/share/locale/instruments_nl.qm'...
    453 Übersetzungen wurden erzeugt (453 abgeschlossen und 0 nicht abgeschlossen)
    474 nicht übersetzte Texte wurden ignoriert
Updating '/Users/build/MuseScore/share/locale/instruments_nn.qm'...
    0 Übersetzungen wurden erzeugt (0 abgeschlossen und 0 nicht abgeschlossen)
    927 nicht übersetzte Texte wurden ignoriert
Updating '/Users/build/MuseScore/share/locale/instruments_pl.qm'...
    927 Übersetzungen wurden erzeugt (927 abgeschlossen und 0 nicht abgeschlossen)
Updating '/Users/build/MuseScore/share/locale/instruments_pt.qm'...
    28 Übersetzungen wurden erzeugt (28 abgeschlossen und 0 nicht abgeschlossen)
    899 nicht übersetzte Texte wurden ignoriert
Updating '/Users/build/MuseScore/share/locale/instruments_pt_BR.qm'...
    48 Übersetzungen wurden erzeugt (48 abgeschlossen und 0 nicht abgeschlossen)
    879 nicht übersetzte Texte wurden ignoriert
Updating '/Users/build/MuseScore/share/locale/instruments_ro.qm'...
    4 Übersetzungen wurden erzeugt (4 abgeschlossen und 0 nicht abgeschlossen)
    923 nicht übersetzte Texte wurden ignoriert
Updating '/Users/build/MuseScore/share/locale/instruments_ru.qm'...
    72 Übersetzungen wurden erzeugt (72 abgeschlossen und 0 nicht abgeschlossen)
    855 nicht übersetzte Texte wurden ignoriert
Updating '/Users/build/MuseScore/share/locale/instruments_sk.qm'...
    37 Übersetzungen wurden erzeugt (37 abgeschlossen und 0 nicht abgeschlossen)
    890 nicht übersetzte Texte wurden ignoriert
Updating '/Users/build/MuseScore/share/locale/instruments_sl.qm'...
    Eine Übersetzung wurde erzeugt (1 abgeschlossen und 0 nicht abgeschlossen)
    926 nicht übersetzte Texte wurden ignoriert
Updating '/Users/build/MuseScore/share/locale/instruments_sr.qm'...
    4 Übersetzungen wurden erzeugt (4 abgeschlossen und 0 nicht abgeschlossen)
    923 nicht übersetzte Texte wurden ignoriert
Updating '/Users/build/MuseScore/share/locale/instruments_sv.qm'...
    139 Übersetzungen wurden erzeugt (139 abgeschlossen und 0 nicht abgeschlossen)
    788 nicht übersetzte Texte wurden ignoriert
Updating '/Users/build/MuseScore/share/locale/instruments_th.qm'...
    163 Übersetzungen wurden erzeugt (163 abgeschlossen und 0 nicht abgeschlossen)
    764 nicht übersetzte Texte wurden ignoriert
Updating '/Users/build/MuseScore/share/locale/instruments_tr.qm'...
    0 Übersetzungen wurden erzeugt (0 abgeschlossen und 0 nicht abgeschlossen)
    927 nicht übersetzte Texte wurden ignoriert
Updating '/Users/build/MuseScore/share/locale/instruments_uk.qm'...
    706 Übersetzungen wurden erzeugt (706 abgeschlossen und 0 nicht abgeschlossen)
    221 nicht übersetzte Texte wurden ignoriert
Updating '/Users/build/MuseScore/share/locale/instruments_uz@Latn.qm'...
    0 Übersetzungen wurden erzeugt (0 abgeschlossen und 0 nicht abgeschlossen)
    927 nicht übersetzte Texte wurden ignoriert
Updating '/Users/build/MuseScore/share/locale/instruments_vi.qm'...
    4 Übersetzungen wurden erzeugt (4 abgeschlossen und 0 nicht abgeschlossen)
    923 nicht übersetzte Texte wurden ignoriert
Updating '/Users/build/MuseScore/share/locale/instruments_zh_CN.qm'...
    912 Übersetzungen wurden erzeugt (912 abgeschlossen und 0 nicht abgeschlossen)
    15 nicht übersetzte Texte wurden ignoriert
Updating '/Users/build/MuseScore/share/locale/instruments_zh_TW.qm'...
    24 Übersetzungen wurden erzeugt (24 abgeschlossen und 0 nicht abgeschlossen)
    903 nicht übersetzte Texte wurden ignoriert
Updating '/Users/build/MuseScore/share/locale/mscore_af.qm'...
    425 Übersetzungen wurden erzeugt (425 abgeschlossen und 0 nicht abgeschlossen)
    3698 nicht übersetzte Texte wurden ignoriert
Updating '/Users/build/MuseScore/share/locale/mscore_ar.qm'...
    1287 Übersetzungen wurden erzeugt (1287 abgeschlossen und 0 nicht abgeschlossen)
    2836 nicht übersetzte Texte wurden ignoriert
Updating '/Users/build/MuseScore/share/locale/mscore_ast.qm'...
    1368 Übersetzungen wurden erzeugt (1368 abgeschlossen und 0 nicht abgeschlossen)
    2755 nicht übersetzte Texte wurden ignoriert
Updating '/Users/build/MuseScore/share/locale/mscore_be.qm'...
    611 Übersetzungen wurden erzeugt (611 abgeschlossen und 0 nicht abgeschlossen)
    3512 nicht übersetzte Texte wurden ignoriert
Updating '/Users/build/MuseScore/share/locale/mscore_bg.qm'...
    1352 Übersetzungen wurden erzeugt (1352 abgeschlossen und 0 nicht abgeschlossen)
    2771 nicht übersetzte Texte wurden ignoriert
Updating '/Users/build/MuseScore/share/locale/mscore_ca.qm'...
    1557 Übersetzungen wurden erzeugt (1557 abgeschlossen und 0 nicht abgeschlossen)
    2566 nicht übersetzte Texte wurden ignoriert
Updating '/Users/build/MuseScore/share/locale/mscore_ca@valencia.qm'...
    3300 Übersetzungen wurden erzeugt (3300 abgeschlossen und 0 nicht abgeschlossen)
    823 nicht übersetzte Texte wurden ignoriert
Updating '/Users/build/MuseScore/share/locale/mscore_cs.qm'...
    4123 Übersetzungen wurden erzeugt (4123 abgeschlossen und 0 nicht abgeschlossen)
Updating '/Users/build/MuseScore/share/locale/mscore_da.qm'...
    1737 Übersetzungen wurden erzeugt (1737 abgeschlossen und 0 nicht abgeschlossen)
    2386 nicht übersetzte Texte wurden ignoriert
Updating '/Users/build/MuseScore/share/locale/mscore_de.qm'...
    4123 Übersetzungen wurden erzeugt (4123 abgeschlossen und 0 nicht abgeschlossen)
Updating '/Users/build/MuseScore/share/locale/mscore_el.qm'...
    2476 Übersetzungen wurden erzeugt (2476 abgeschlossen und 0 nicht abgeschlossen)
    1647 nicht übersetzte Texte wurden ignoriert
Updating '/Users/build/MuseScore/share/locale/mscore_en_GB.qm'...
    4123 Übersetzungen wurden erzeugt (4123 abgeschlossen und 0 nicht abgeschlossen)
Updating '/Users/build/MuseScore/share/locale/mscore_en_US.qm'...
    45 Übersetzungen wurden erzeugt (45 abgeschlossen und 0 nicht abgeschlossen)
    4078 nicht übersetzte Texte wurden ignoriert
Updating '/Users/build/MuseScore/share/locale/mscore_eo.qm'...
    1647 Übersetzungen wurden erzeugt (1647 abgeschlossen und 0 nicht abgeschlossen)
    2476 nicht übersetzte Texte wurden ignoriert
Updating '/Users/build/MuseScore/share/locale/mscore_es.qm'...
    3609 Übersetzungen wurden erzeugt (3609 abgeschlossen und 0 nicht abgeschlossen)
    514 nicht übersetzte Texte wurden ignoriert
Updating '/Users/build/MuseScore/share/locale/mscore_et.qm'...
    1150 Übersetzungen wurden erzeugt (1150 abgeschlossen und 0 nicht abgeschlossen)
    2973 nicht übersetzte Texte wurden ignoriert
Updating '/Users/build/MuseScore/share/locale/mscore_eu.qm'...
    1437 Übersetzungen wurden erzeugt (1437 abgeschlossen und 0 nicht abgeschlossen)
    2686 nicht übersetzte Texte wurden ignoriert
Updating '/Users/build/MuseScore/share/locale/mscore_fa.qm'...
    1577 Übersetzungen wurden erzeugt (1577 abgeschlossen und 0 nicht abgeschlossen)
    2546 nicht übersetzte Texte wurden ignoriert
Updating '/Users/build/MuseScore/share/locale/mscore_fi.qm'...
    1871 Übersetzungen wurden erzeugt (1871 abgeschlossen und 0 nicht abgeschlossen)
    2252 nicht übersetzte Texte wurden ignoriert
Updating '/Users/build/MuseScore/share/locale/mscore_fo.qm'...
    1375 Übersetzungen wurden erzeugt (1375 abgeschlossen und 0 nicht abgeschlossen)
    2748 nicht übersetzte Texte wurden ignoriert
Updating '/Users/build/MuseScore/share/locale/mscore_fr.qm'...
    3853 Übersetzungen wurden erzeugt (3853 abgeschlossen und 0 nicht abgeschlossen)
    270 nicht übersetzte Texte wurden ignoriert
Updating '/Users/build/MuseScore/share/locale/mscore_gl.qm'...
    3827 Übersetzungen wurden erzeugt (3827 abgeschlossen und 0 nicht abgeschlossen)
    296 nicht übersetzte Texte wurden ignoriert
Updating '/Users/build/MuseScore/share/locale/mscore_he.qm'...
    1071 Übersetzungen wurden erzeugt (1071 abgeschlossen und 0 nicht abgeschlossen)
    3052 nicht übersetzte Texte wurden ignoriert
Updating '/Users/build/MuseScore/share/locale/mscore_hi_IN.qm'...
    264 Übersetzungen wurden erzeugt (264 abgeschlossen und 0 nicht abgeschlossen)
    3859 nicht übersetzte Texte wurden ignoriert
Updating '/Users/build/MuseScore/share/locale/mscore_hr.qm'...
    1376 Übersetzungen wurden erzeugt (1376 abgeschlossen und 0 nicht abgeschlossen)
    2747 nicht übersetzte Texte wurden ignoriert
Updating '/Users/build/MuseScore/share/locale/mscore_hu.qm'...
    3316 Übersetzungen wurden erzeugt (3316 abgeschlossen und 0 nicht abgeschlossen)
    807 nicht übersetzte Texte wurden ignoriert
Updating '/Users/build/MuseScore/share/locale/mscore_id.qm'...
    340 Übersetzungen wurden erzeugt (340 abgeschlossen und 0 nicht abgeschlossen)
    3783 nicht übersetzte Texte wurden ignoriert
Updating '/Users/build/MuseScore/share/locale/mscore_it.qm'...
    4123 Übersetzungen wurden erzeugt (4123 abgeschlossen und 0 nicht abgeschlossen)
Updating '/Users/build/MuseScore/share/locale/mscore_ja.qm'...
    3964 Übersetzungen wurden erzeugt (3964 abgeschlossen und 0 nicht abgeschlossen)
    159 nicht übersetzte Texte wurden ignoriert
Updating '/Users/build/MuseScore/share/locale/mscore_ka.qm'...
    511 Übersetzungen wurden erzeugt (511 abgeschlossen und 0 nicht abgeschlossen)
    3612 nicht übersetzte Texte wurden ignoriert
Updating '/Users/build/MuseScore/share/locale/mscore_ko.qm'...
    919 Übersetzungen wurden erzeugt (919 abgeschlossen und 0 nicht abgeschlossen)
    3204 nicht übersetzte Texte wurden ignoriert
Updating '/Users/build/MuseScore/share/locale/mscore_lt.qm'...
    1421 Übersetzungen wurden erzeugt (1421 abgeschlossen und 0 nicht abgeschlossen)
    2702 nicht übersetzte Texte wurden ignoriert
Updating '/Users/build/MuseScore/share/locale/mscore_mn_MN.qm'...
    227 Übersetzungen wurden erzeugt (227 abgeschlossen und 0 nicht abgeschlossen)
    3896 nicht übersetzte Texte wurden ignoriert
Updating '/Users/build/MuseScore/share/locale/mscore_nb.qm'...
    1717 Übersetzungen wurden erzeugt (1717 abgeschlossen und 0 nicht abgeschlossen)
    2406 nicht übersetzte Texte wurden ignoriert
Updating '/Users/build/MuseScore/share/locale/mscore_nl.qm'...
    3484 Übersetzungen wurden erzeugt (3484 abgeschlossen und 0 nicht abgeschlossen)
    639 nicht übersetzte Texte wurden ignoriert
Updating '/Users/build/MuseScore/share/locale/mscore_nn.qm'...
    0 Übersetzungen wurden erzeugt (0 abgeschlossen und 0 nicht abgeschlossen)
    4123 nicht übersetzte Texte wurden ignoriert
Updating '/Users/build/MuseScore/share/locale/mscore_pl.qm'...
    4123 Übersetzungen wurden erzeugt (4123 abgeschlossen und 0 nicht abgeschlossen)
Updating '/Users/build/MuseScore/share/locale/mscore_pt.qm'...
    1363 Übersetzungen wurden erzeugt (1363 abgeschlossen und 0 nicht abgeschlossen)
    2760 nicht übersetzte Texte wurden ignoriert
Updating '/Users/build/MuseScore/share/locale/mscore_pt_BR.qm'...
    2191 Übersetzungen wurden erzeugt (2191 abgeschlossen und 0 nicht abgeschlossen)
    1932 nicht übersetzte Texte wurden ignoriert
Updating '/Users/build/MuseScore/share/locale/mscore_ro.qm'...
    1543 Übersetzungen wurden erzeugt (1543 abgeschlossen und 0 nicht abgeschlossen)
    2580 nicht übersetzte Texte wurden ignoriert
Updating '/Users/build/MuseScore/share/locale/mscore_ru.qm'...
    1822 Übersetzungen wurden erzeugt (1822 abgeschlossen und 0 nicht abgeschlossen)
    2301 nicht übersetzte Texte wurden ignoriert
Updating '/Users/build/MuseScore/share/locale/mscore_sk.qm'...
    1437 Übersetzungen wurden erzeugt (1437 abgeschlossen und 0 nicht abgeschlossen)
    2686 nicht übersetzte Texte wurden ignoriert
Updating '/Users/build/MuseScore/share/locale/mscore_sl.qm'...
    847 Übersetzungen wurden erzeugt (847 abgeschlossen und 0 nicht abgeschlossen)
    3276 nicht übersetzte Texte wurden ignoriert
Updating '/Users/build/MuseScore/share/locale/mscore_sr.qm'...
    1807 Übersetzungen wurden erzeugt (1807 abgeschlossen und 0 nicht abgeschlossen)
    2316 nicht übersetzte Texte wurden ignoriert
Updating '/Users/build/MuseScore/share/locale/mscore_sv.qm'...
    3703 Übersetzungen wurden erzeugt (3703 abgeschlossen und 0 nicht abgeschlossen)
    420 nicht übersetzte Texte wurden ignoriert
Updating '/Users/build/MuseScore/share/locale/mscore_th.qm'...
    1099 Übersetzungen wurden erzeugt (1099 abgeschlossen und 0 nicht abgeschlossen)
    3024 nicht übersetzte Texte wurden ignoriert
Updating '/Users/build/MuseScore/share/locale/mscore_tr.qm'...
    894 Übersetzungen wurden erzeugt (894 abgeschlossen und 0 nicht abgeschlossen)
    3229 nicht übersetzte Texte wurden ignoriert
Updating '/Users/build/MuseScore/share/locale/mscore_uk.qm'...
    3654 Übersetzungen wurden erzeugt (3654 abgeschlossen und 0 nicht abgeschlossen)
    469 nicht übersetzte Texte wurden ignoriert
Updating '/Users/build/MuseScore/share/locale/mscore_uz@Latn.qm'...
    234 Übersetzungen wurden erzeugt (234 abgeschlossen und 0 nicht abgeschlossen)
    3889 nicht übersetzte Texte wurden ignoriert
Updating '/Users/build/MuseScore/share/locale/mscore_vi.qm'...
    1406 Übersetzungen wurden erzeugt (1406 abgeschlossen und 0 nicht abgeschlossen)
    2717 nicht übersetzte Texte wurden ignoriert
Updating '/Users/build/MuseScore/share/locale/mscore_zh_CN.qm'...
    2001 Übersetzungen wurden erzeugt (2001 abgeschlossen und 0 nicht abgeschlossen)
    2122 nicht übersetzte Texte wurden ignoriert
Updating '/Users/build/MuseScore/share/locale/mscore_zh_TW.qm'...
    1454 Übersetzungen wurden erzeugt (1454 abgeschlossen und 0 nicht abgeschlossen)
    2669 nicht übersetzte Texte wurden ignoriert
Updating '/Users/build/MuseScore/share/locale/qt_ar.qm'...
    408 Übersetzungen wurden erzeugt (107 abgeschlossen und 301 nicht abgeschlossen)
    801 nicht übersetzte Texte wurden ignoriert
Updating '/Users/build/MuseScore/share/locale/qt_bg.qm'...
    908 Übersetzungen wurden erzeugt (907 abgeschlossen und 1 nicht abgeschlossen)
    301 nicht übersetzte Texte wurden ignoriert
Updating '/Users/build/MuseScore/share/locale/qt_ca.qm'...
    1209 Übersetzungen wurden erzeugt (1209 abgeschlossen und 0 nicht abgeschlossen)
Updating '/Users/build/MuseScore/share/locale/qt_cs.qm'...
    1802 Übersetzungen wurden erzeugt (1802 abgeschlossen und 0 nicht abgeschlossen)
    7 nicht übersetzte Texte wurden ignoriert
Updating '/Users/build/MuseScore/share/locale/qt_da.qm'...
    1065 Übersetzungen wurden erzeugt (1065 abgeschlossen und 0 nicht abgeschlossen)
    144 nicht übersetzte Texte wurden ignoriert
Updating '/Users/build/MuseScore/share/locale/qt_de.qm'...
    1207 Übersetzungen wurden erzeugt (1207 abgeschlossen und 0 nicht abgeschlossen)
    2 nicht übersetzte Texte wurden ignoriert
Updating '/Users/build/MuseScore/share/locale/qt_el.qm'...
    672 Übersetzungen wurden erzeugt (0 abgeschlossen und 672 nicht abgeschlossen)
    537 nicht übersetzte Texte wurden ignoriert
Updating '/Users/build/MuseScore/share/locale/qt_es.qm'...
    778 Übersetzungen wurden erzeugt (727 abgeschlossen und 51 nicht abgeschlossen)
    431 nicht übersetzte Texte wurden ignoriert
Updating '/Users/build/MuseScore/share/locale/qt_eu.qm'...
    0 Übersetzungen wurden erzeugt (0 abgeschlossen und 0 nicht abgeschlossen)
    1202 nicht übersetzte Texte wurden ignoriert
Updating '/Users/build/MuseScore/share/locale/qt_fa.qm'...
    Eine Übersetzung wurde erzeugt (1 abgeschlossen und 0 nicht abgeschlossen)
    1208 nicht übersetzte Texte wurden ignoriert
Updating '/Users/build/MuseScore/share/locale/qt_fi.qm'...
    556 Übersetzungen wurden erzeugt (449 abgeschlossen und 107 nicht abgeschlossen)
    653 nicht übersetzte Texte wurden ignoriert
Updating '/Users/build/MuseScore/share/locale/qt_fr.qm'...
    1207 Übersetzungen wurden erzeugt (1207 abgeschlossen und 0 nicht abgeschlossen)
    2 nicht übersetzte Texte wurden ignoriert
Updating '/Users/build/MuseScore/share/locale/qt_gl.qm'...
    1202 Übersetzungen wurden erzeugt (1202 abgeschlossen und 0 nicht abgeschlossen)
    7 nicht übersetzte Texte wurden ignoriert
Updating '/Users/build/MuseScore/share/locale/qt_he.qm'...
    348 Übersetzungen wurden erzeugt (87 abgeschlossen und 261 nicht abgeschlossen)
    1051 nicht übersetzte Texte wurden ignoriert
Updating '/Users/build/MuseScore/share/locale/qt_hu.qm'...
    1064 Übersetzungen wurden erzeugt (1063 abgeschlossen und 1 nicht abgeschlossen)
    145 nicht übersetzte Texte wurden ignoriert
Updating '/Users/build/MuseScore/share/locale/qt_id.qm'...
    0 Übersetzungen wurden erzeugt (0 abgeschlossen und 0 nicht abgeschlossen)
    1209 nicht übersetzte Texte wurden ignoriert
Updating '/Users/build/MuseScore/share/locale/qt_it.qm'...
    926 Übersetzungen wurden erzeugt (920 abgeschlossen und 6 nicht abgeschlossen)
    283 nicht übersetzte Texte wurden ignoriert
Warning: ignoring <defaultcodec> element
Updating '/Users/build/MuseScore/share/locale/qt_ja.qm'...
    703 Übersetzungen wurden erzeugt (662 abgeschlossen und 41 nicht abgeschlossen)
    506 nicht übersetzte Texte wurden ignoriert
Updating '/Users/build/MuseScore/share/locale/qt_ko.qm'...
    1065 Übersetzungen wurden erzeugt (1065 abgeschlossen und 0 nicht abgeschlossen)
    144 nicht übersetzte Texte wurden ignoriert
Updating '/Users/build/MuseScore/share/locale/qt_lt.qm'...
    856 Übersetzungen wurden erzeugt (849 abgeschlossen und 7 nicht abgeschlossen)
    353 nicht übersetzte Texte wurden ignoriert
Updating '/Users/build/MuseScore/share/locale/qt_nl.qm'...
    1209 Übersetzungen wurden erzeugt (1209 abgeschlossen und 0 nicht abgeschlossen)
Updating '/Users/build/MuseScore/share/locale/qt_pl.qm'...
    1859 Übersetzungen wurden erzeugt (1858 abgeschlossen und 1 nicht abgeschlossen)
Updating '/Users/build/MuseScore/share/locale/qt_pt.qm'...
    700 Übersetzungen wurden erzeugt (621 abgeschlossen und 79 nicht abgeschlossen)
    509 nicht übersetzte Texte wurden ignoriert
Updating '/Users/build/MuseScore/share/locale/qt_pt_BR.qm'...
    1209 Übersetzungen wurden erzeugt (1209 abgeschlossen und 0 nicht abgeschlossen)
Updating '/Users/build/MuseScore/share/locale/qt_ro.qm'...
    5 Übersetzungen wurden erzeugt (0 abgeschlossen und 5 nicht abgeschlossen)
    1204 nicht übersetzte Texte wurden ignoriert
Updating '/Users/build/MuseScore/share/locale/qt_ru.qm'...
    415 Übersetzungen wurden erzeugt (114 abgeschlossen und 301 nicht abgeschlossen)
    794 nicht übersetzte Texte wurden ignoriert
Updating '/Users/build/MuseScore/share/locale/qt_sk.qm'...
    799 Übersetzungen wurden erzeugt (751 abgeschlossen und 48 nicht abgeschlossen)
    403 nicht übersetzte Texte wurden ignoriert
Updating '/Users/build/MuseScore/share/locale/qt_sl.qm'...
    1501 Übersetzungen wurden erzeugt (1496 abgeschlossen und 5 nicht abgeschlossen)
    301 nicht übersetzte Texte wurden ignoriert
Updating '/Users/build/MuseScore/share/locale/qt_sv.qm'...
    1054 Übersetzungen wurden erzeugt (1054 abgeschlossen und 0 nicht abgeschlossen)
    155 nicht übersetzte Texte wurden ignoriert
Updating '/Users/build/MuseScore/share/locale/qt_tr.qm'...
Removed plural forms as the target language has less forms.
If this sounds wrong, possibly the target language is not set or recognized.
    763 Übersetzungen wurden erzeugt (712 abgeschlossen und 51 nicht abgeschlossen)
    446 nicht übersetzte Texte wurden ignoriert
Updating '/Users/build/MuseScore/share/locale/qt_uk.qm'...
    782 Übersetzungen wurden erzeugt (731 abgeschlossen und 51 nicht abgeschlossen)
    427 nicht übersetzte Texte wurden ignoriert
Updating '/Users/build/MuseScore/share/locale/qt_vi.qm'...
    22 Übersetzungen wurden erzeugt (22 abgeschlossen und 0 nicht abgeschlossen)
    1180 nicht übersetzte Texte wurden ignoriert
Updating '/Users/build/MuseScore/share/locale/qt_zh_CN.qm'...
    1207 Übersetzungen wurden erzeugt (1206 abgeschlossen und 1 nicht abgeschlossen)
    2 nicht übersetzte Texte wurden ignoriert
Updating '/Users/build/MuseScore/share/locale/qt_zh_TW.qm'...
    1209 Übersetzungen wurden erzeugt (1209 abgeschlossen und 0 nicht abgeschlossen)
Showing first 200 notices only

** BUILD SUCCEEDED **

=== BUILD AGGREGATE TARGET ZERO_CHECK OF PROJECT mscore WITH CONFIGURATION Release ===

Check dependencies

Write auxiliary files
/bin/mkdir -p /Users/build/MuseScore/build.release/mscore.build/Release/ZERO_CHECK.build
write-file /Users/build/MuseScore/build.release/mscore.build/Release/ZERO_CHECK.build/Script-FC6ED9DF099A46F893B2550D.sh
chmod 0755 /Users/build/MuseScore/build.release/mscore.build/Release/ZERO_CHECK.build/Script-FC6ED9DF099A46F893B2550D.sh

PhaseScriptExecution CMake\ Rules build.release/mscore.build/Release/ZERO_CHECK.build/Script-FC6ED9DF099A46F893B2550D.sh
    cd /Users/build/MuseScore
    /bin/sh -c /Users/build/MuseScore/build.release/mscore.build/Release/ZERO_CHECK.build/Script-FC6ED9DF099A46F893B2550D.sh
echo ""

make -f /Users/build/MuseScore/build.release/CMakeScripts/ReRunCMake.make
make[2]: `/Users/build/MuseScore/build.release/CMakeFiles/cmake.check_cache' is up to date.

=== BUILD AGGREGATE TARGET mops1 OF PROJECT mscore WITH CONFIGURATION Release ===

Check dependencies

Write auxiliary files
/bin/mkdir -p /Users/build/MuseScore/build.release/mscore.build/Release/mops1.build
write-file /Users/build/MuseScore/build.release/mscore.build/Release/mops1.build/Script-B400CF56EDFF483D84DD85AB.sh
chmod 0755 /Users/build/MuseScore/build.release/mscore.build/Release/mops1.build/Script-B400CF56EDFF483D84DD85AB.sh

PhaseScriptExecution CMake\ Rules build.release/mscore.build/Release/mops1.build/Script-B400CF56EDFF483D84DD85AB.sh
    cd /Users/build/MuseScore
    /bin/sh -c /Users/build/MuseScore/build.release/mscore.build/Release/mops1.build/Script-B400CF56EDFF483D84DD85AB.sh
cd /Users/build/MuseScore/build.release && /usr/local/Cellar/cmake/3.1.1_1/bin/cmake -E copy /Users/build/MuseScore/all.h /Users/build/MuseScore/build.release/all.h

=== BUILD AGGREGATE TARGET mops2 OF PROJECT mscore WITH CONFIGURATION Release ===

Check dependencies

=== BUILD AGGREGATE TARGET awl_automoc OF PROJECT mscore WITH CONFIGURATION Release ===

Check dependencies

Write auxiliary files
/bin/mkdir -p /Users/build/MuseScore/build.release/awl/mscore.build/Release/awl_automoc.build
write-file /Users/build/MuseScore/build.release/awl/mscore.build/Release/awl_automoc.build/Script-37208A6730B34F909C6F680E.sh
chmod 0755 /Users/build/MuseScore/build.release/awl/mscore.build/Release/awl_automoc.build/Script-37208A6730B34F909C6F680E.sh

PhaseScriptExecution CMake\ Rules build.release/awl/mscore.build/Release/awl_automoc.build/Script-37208A6730B34F909C6F680E.sh
    cd /Users/build/MuseScore
    /bin/sh -c /Users/build/MuseScore/build.release/awl/mscore.build/Release/awl_automoc.build/Script-37208A6730B34F909C6F680E.sh
echo "Automatic moc for target awl"
Automatic moc for target awl
cd /Users/build/MuseScore/build.release/awl && /usr/local/Cellar/cmake/3.1.1_1/bin/cmake -E cmake_autogen /Users/build/MuseScore/build.release/awl/CMakeFiles/awl_automoc.dir/ Release
Generating moc_aslider.cpp
Generating moc_colorlabel.cpp
Generating moc_denomspinbox.cpp
Generating moc_knob.cpp
Generating moc_midipanknob.cpp
Generating moc_mslider.cpp
Generating moc_panknob.cpp
Generating moc_pitchedit.cpp
Generating moc_pitchlabel.cpp
Generating moc_poslabel.cpp
Generating moc_slider.cpp
Generating moc_volknob.cpp
Generating moc_volslider.cpp

=== BUILD TARGET awl OF PROJECT mscore WITH CONFIGURATION Release ===

Check dependencies

Write auxiliary files
/bin/mkdir -p /Users/build/MuseScore/build.release/awl/mscore.build/Release/awl.build/Objects-normal/x86_64
write-file /Users/build/MuseScore/build.release/awl/mscore.build/Release/awl.build/Objects-normal/x86_64/awl.LinkFileList
/bin/mkdir -p /var/folders/_p/zg2h1pkn3vx5ngw4dfy7nbcr0000gn/C/com.apple.DeveloperTools/6.1.1-6A2008a/Xcode/SharedPrecompiledHeaders/all-ckqeeqmjhoqfpwcahcuhqhmyqwix
write-file /var/folders/_p/zg2h1pkn3vx5ngw4dfy7nbcr0000gn/C/com.apple.DeveloperTools/6.1.1-6A2008a/Xcode/SharedPrecompiledHeaders/all-ckqeeqmjhoqfpwcahcuhqhmyqwix/all.h.pch.hash-criteria

ProcessPCH++ /var/folders/_p/zg2h1pkn3vx5ngw4dfy7nbcr0000gn/C/com.apple.DeveloperTools/6.1.1-6A2008a/Xcode/SharedPrecompiledHeaders/all-ckqeeqmjhoqfpwcahcuhqhmyqwix/all.h.pch build.release/all.h normal x86_64 c++ com.apple.compilers.llvm.clang.1_0.compiler
    cd /Users/build/MuseScore
    export LANG=en_US.US-ASCII
    /Applications/Xcode.app/Contents/Developer/Toolchains/XcodeDefault.xctoolchain/usr/bin/clang -x c++-header -arch x86_64 -fmessage-length=80 -fdiagnostics-show-note-include-stack -fmacro-backtrace-limit=0 -fcolor-diagnostics -Wno-trigraphs -fpascal-strings -O2 -Wno-missing-field-initializers -Wno-missing-prototypes -Wno-return-type -Wno-non-virtual-dtor -Wno-overloaded-virtual -Wno-exit-time-destructors -Wno-missing-braces -Wparentheses -Wswitch -Wno-unused-function -Wno-unused-label -Wno-unused-parameter -Wno-unused-variable -Wunused-value -Wno-empty-body -Wno-uninitialized -Wno-unknown-pragmas -Wno-shadow -Wno-four-char-constants -Wno-conversion -Wno-constant-conversion -Wno-int-conversion -Wno-bool-conversion -Wno-enum-conversion -Wno-shorten-64-to-32 -Wno-newline-eof -Wno-c++11-extensions -DCMAKE_INTDIR=\"Release\" -DQT_DISABLE_DEPRECATED_BEFORE=0 -isysroot /Applications/Xcode.app/Contents/Developer/Platforms/MacOSX.platform/Developer/SDKs/MacOSX10.10.sdk -fasm-blocks -fstrict-aliasing -Wdeprecated-declarations -Winvalid-offsetof -mmacosx-version-min=10.7 -g -Wno-sign-conversion -I/Users/build/MuseScore/build.release/awl/Release/include -I/Users/build/MuseScore/build.release/awl -I/Users/build/MuseScore/awl -I/Users/build/Qt/5.4/clang_64/lib/QtGui.framework/Headers -I/Users/build/Qt/5.4/clang_64/lib/QtCore.framework/Headers -I/Users/build/Qt/5.4/clang_64/mkspecs/macx-clang -I/Applications/Xcode.app/Contents/Developer/Platforms/MacOSX.platform/Developer/SDKs/MacOSX10.10.sdk/System/Library/Frameworks/OpenGL.framework/Headers -I/Users/build/Qt/5.4/clang_64/lib/QtWidgets.framework/Headers -I/Users/build/Qt/5.4/clang_64/lib/QtPrintSupport.framework/Headers -I/Users/build/Qt/5.4/clang_64/lib/QtSvg.framework/Headers -I/Users/build/Qt/5.4/clang_64/lib/QtDeclarative.framework/Headers -I/Users/build/Qt/5.4/clang_64/lib/QtScript.framework/Headers -I/Users/build/Qt/5.4/clang_64/lib/QtScriptTools.framework/Headers -I/Users/build/Qt/5.4/clang_64/lib/QtNetwork.framework/Headers -I/Users/build/Qt/5.4/clang_64/lib/QtTest.framework/Headers -I/Users/build/Qt/5.4/clang_64/lib/QtDesigner.framework/Headers -I/Users/build/Qt/5.4/clang_64/lib/QtXml.framework/Headers -I/Users/build/Qt/5.4/clang_64/lib/QtConcurrent.framework/Headers -I/Users/build/Qt/5.4/clang_64/lib/QtXmlPatterns.framework/Headers -I/Users/build/Qt/5.4/clang_64/include -I/Users/build/Qt/5.4/clang_64/include/QtUiTools -I/Users/build/Qt/5.4/clang_64/lib/QtQml.framework/Headers -I/Users/build/Qt/5.4/clang_64/lib/QtQuick.framework/Headers -I/Users/build/Qt/5.4/clang_64/lib/QtQuickWidgets.framework/Headers -I/Users/build/Qt/5.4/clang_64/lib/QtWebKit.framework/Headers -I/Users/build/Qt/5.4/clang_64/lib/QtWebKitWidgets.framework/Headers -I/Users/build/Qt/5.4/clang_64/lib/QtSql.framework/Headers -I/Users/build/Qt/5.4/clang_64/lib/QtOpenGL.framework/Headers -I/Users/build/MuseScore -I/Users/build/MuseScore/build.release -I/usr/local/Cellar/jack/0.124.1/include -I/usr/local/Cellar/portaudio/19.20140130/include -I/usr/local/Cellar/libogg/1.3.2/include -I/usr/local/Cellar/libvorbis/1.3.4/include -I/usr/local/Cellar/libsndfile/1.0.25/include -I/usr/local/include -I/Users/build/MuseScore/build.release/awl/mscore.build/Release/awl.build/DerivedSources/x86_64 -I/Users/build/MuseScore/build.release/awl/mscore.build/Release/awl.build/DerivedSources -Wmost -Wno-four-char-constants -Wno-unknown-pragmas -F/Users/build/MuseScore/build.release/awl/Release -F/Users/build/Qt/5.4/clang_64/lib -std=c++0x -fPIC -stdlib=libc++ -DNDEBUG -DQT_NO_DEBUG -Wall -Wextra -Winvalid-pch -MD -MT dependencies -MF /var/folders/_p/zg2h1pkn3vx5ngw4dfy7nbcr0000gn/C/com.apple.DeveloperTools/6.1.1-6A2008a/Xcode/SharedPrecompiledHeaders/all-ckqeeqmjhoqfpwcahcuhqhmyqwix/all.h.d -c /Users/build/MuseScore/build.release/all.h -o /var/folders/_p/zg2h1pkn3vx5ngw4dfy7nbcr0000gn/C/com.apple.DeveloperTools/6.1.1-6A2008a/Xcode/SharedPrecompiledHeaders/all-ckqeeqmjhoqfpwcahcuhqhmyqwix/all.h.pch --serialize-diagnostics /var/folders/_p/zg2h1pkn3vx5ngw4dfy7nbcr0000gn/C/com.apple.DeveloperTools/6.1.1-6A2008a/Xcode/SharedPrecompiledHeaders/all-ckqeeqmjhoqfpwcahcuhqhmyqwix/all.h.dia

CompileC build.release/awl/mscore.build/Release/awl.build/Objects-normal/x86_64/aslider.o awl/aslider.cpp normal x86_64 c++ com.apple.compilers.llvm.clang.1_0.compiler
    cd /Users/build/MuseScore
    export LANG=en_US.US-ASCII
    /Applications/Xcode.app/Contents/Developer/Toolchains/XcodeDefault.xctoolchain/usr/bin/clang -x c++ -arch x86_64 -fmessage-length=80 -fdiagnostics-show-note-include-stack -fmacro-backtrace-limit=0 -fcolor-diagnostics -Wno-trigraphs -fpascal-strings -O2 -Wno-missing-field-initializers -Wno-missing-prototypes -Wno-return-type -Wno-non-virtual-dtor -Wno-overloaded-virtual -Wno-exit-time-destructors -Wno-missing-braces -Wparentheses -Wswitch -Wno-unused-function -Wno-unused-label -Wno-unused-parameter -Wno-unused-variable -Wunused-value -Wno-empty-body -Wno-uninitialized -Wno-unknown-pragmas -Wno-shadow -Wno-four-char-constants -Wno-conversion -Wno-constant-conversion -Wno-int-conversion -Wno-bool-conversion -Wno-enum-conversion -Wno-shorten-64-to-32 -Wno-newline-eof -Wno-c++11-extensions -DCMAKE_INTDIR=\"Release\" -DQT_DISABLE_DEPRECATED_BEFORE=0 -isysroot /Applications/Xcode.app/Contents/Developer/Platforms/MacOSX.platform/Developer/SDKs/MacOSX10.10.sdk -fasm-blocks -fstrict-aliasing -Wdeprecated-declarations -Winvalid-offsetof -mmacosx-version-min=10.7 -g -Wno-sign-conversion -I/Users/build/MuseScore/build.release/awl/Release/include -I/Users/build/MuseScore/build.release/awl -I/Users/build/MuseScore/awl -I/Users/build/Qt/5.4/clang_64/lib/QtGui.framework/Headers -I/Users/build/Qt/5.4/clang_64/lib/QtCore.framework/Headers -I/Users/build/Qt/5.4/clang_64/mkspecs/macx-clang -I/Applications/Xcode.app/Contents/Developer/Platforms/MacOSX.platform/Developer/SDKs/MacOSX10.10.sdk/System/Library/Frameworks/OpenGL.framework/Headers -I/Users/build/Qt/5.4/clang_64/lib/QtWidgets.framework/Headers -I/Users/build/Qt/5.4/clang_64/lib/QtPrintSupport.framework/Headers -I/Users/build/Qt/5.4/clang_64/lib/QtSvg.framework/Headers -I/Users/build/Qt/5.4/clang_64/lib/QtDeclarative.framework/Headers -I/Users/build/Qt/5.4/clang_64/lib/QtScript.framework/Headers -I/Users/build/Qt/5.4/clang_64/lib/QtScriptTools.framework/Headers -I/Users/build/Qt/5.4/clang_64/lib/QtNetwork.framework/Headers -I/Users/build/Qt/5.4/clang_64/lib/QtTest.framework/Headers -I/Users/build/Qt/5.4/clang_64/lib/QtDesigner.framework/Headers -I/Users/build/Qt/5.4/clang_64/lib/QtXml.framework/Headers -I/Users/build/Qt/5.4/clang_64/lib/QtConcurrent.framework/Headers -I/Users/build/Qt/5.4/clang_64/lib/QtXmlPatterns.framework/Headers -I/Users/build/Qt/5.4/clang_64/include -I/Users/build/Qt/5.4/clang_64/include/QtUiTools -I/Users/build/Qt/5.4/clang_64/lib/QtQml.framework/Headers -I/Users/build/Qt/5.4/clang_64/lib/QtQuick.framework/Headers -I/Users/build/Qt/5.4/clang_64/lib/QtQuickWidgets.framework/Headers -I/Users/build/Qt/5.4/clang_64/lib/QtWebKit.framework/Headers -I/Users/build/Qt/5.4/clang_64/lib/QtWebKitWidgets.framework/Headers -I/Users/build/Qt/5.4/clang_64/lib/QtSql.framework/Headers -I/Users/build/Qt/5.4/clang_64/lib/QtOpenGL.framework/Headers -I/Users/build/MuseScore -I/Users/build/MuseScore/build.release -I/usr/local/Cellar/jack/0.124.1/include -I/usr/local/Cellar/portaudio/19.20140130/include -I/usr/local/Cellar/libogg/1.3.2/include -I/usr/local/Cellar/libvorbis/1.3.4/include -I/usr/local/Cellar/libsndfile/1.0.25/include -I/usr/local/include -I/Users/build/MuseScore/build.release/awl/mscore.build/Release/awl.build/DerivedSources/x86_64 -I/Users/build/MuseScore/build.release/awl/mscore.build/Release/awl.build/DerivedSources -Wmost -Wno-four-char-constants -Wno-unknown-pragmas -F/Users/build/MuseScore/build.release/awl/Release -F/Users/build/Qt/5.4/clang_64/lib -std=c++0x -fPIC -stdlib=libc++ -DNDEBUG -DQT_NO_DEBUG -Wall -Wextra -Winvalid-pch -include /var/folders/_p/zg2h1pkn3vx5ngw4dfy7nbcr0000gn/C/com.apple.DeveloperTools/6.1.1-6A2008a/Xcode/SharedPrecompiledHeaders/all-ckqeeqmjhoqfpwcahcuhqhmyqwix/all.h -MMD -MT dependencies -MF /Users/build/MuseScore/build.release/awl/mscore.build/Release/awl.build/Objects-normal/x86_64/aslider.d --serialize-diagnostics /Users/build/MuseScore/build.release/awl/mscore.build/Release/awl.build/Objects-normal/x86_64/aslider.dia -c /Users/build/MuseScore/awl/aslider.cpp -o /Users/build/MuseScore/build.release/awl/mscore.build/Release/awl.build/Objects-normal/x86_64/aslider.o

CompileC build.release/awl/mscore.build/Release/awl.build/Objects-normal/x86_64/colorlabel.o awl/colorlabel.cpp normal x86_64 c++ com.apple.compilers.llvm.clang.1_0.compiler
    cd /Users/build/MuseScore
    export LANG=en_US.US-ASCII
    /Applications/Xcode.app/Contents/Developer/Toolchains/XcodeDefault.xctoolchain/usr/bin/clang -x c++ -arch x86_64 -fmessage-length=80 -fdiagnostics-show-note-include-stack -fmacro-backtrace-limit=0 -fcolor-diagnostics -Wno-trigraphs -fpascal-strings -O2 -Wno-missing-field-initializers -Wno-missing-prototypes -Wno-return-type -Wno-non-virtual-dtor -Wno-overloaded-virtual -Wno-exit-time-destructors -Wno-missing-braces -Wparentheses -Wswitch -Wno-unused-function -Wno-unused-label -Wno-unused-parameter -Wno-unused-variable -Wunused-value -Wno-empty-body -Wno-uninitialized -Wno-unknown-pragmas -Wno-shadow -Wno-four-char-constants -Wno-conversion -Wno-constant-conversion -Wno-int-conversion -Wno-bool-conversion -Wno-enum-conversion -Wno-shorten-64-to-32 -Wno-newline-eof -Wno-c++11-extensions -DCMAKE_INTDIR=\"Release\" -DQT_DISABLE_DEPRECATED_BEFORE=0 -isysroot /Applications/Xcode.app/Contents/Developer/Platforms/MacOSX.platform/Developer/SDKs/MacOSX10.10.sdk -fasm-blocks -fstrict-aliasing -Wdeprecated-declarations -Winvalid-offsetof -mmacosx-version-min=10.7 -g -Wno-sign-conversion -I/Users/build/MuseScore/build.release/awl/Release/include -I/Users/build/MuseScore/build.release/awl -I/Users/build/MuseScore/awl -I/Users/build/Qt/5.4/clang_64/lib/QtGui.framework/Headers -I/Users/build/Qt/5.4/clang_64/lib/QtCore.framework/Headers -I/Users/build/Qt/5.4/clang_64/mkspecs/macx-clang -I/Applications/Xcode.app/Contents/Developer/Platforms/MacOSX.platform/Developer/SDKs/MacOSX10.10.sdk/System/Library/Frameworks/OpenGL.framework/Headers -I/Users/build/Qt/5.4/clang_64/lib/QtWidgets.framework/Headers -I/Users/build/Qt/5.4/clang_64/lib/QtPrintSupport.framework/Headers -I/Users/build/Qt/5.4/clang_64/lib/QtSvg.framework/Headers -I/Users/build/Qt/5.4/clang_64/lib/QtDeclarative.framework/Headers -I/Users/build/Qt/5.4/clang_64/lib/QtScript.framework/Headers -I/Users/build/Qt/5.4/clang_64/lib/QtScriptTools.framework/Headers -I/Users/build/Qt/5.4/clang_64/lib/QtNetwork.framework/Headers -I/Users/build/Qt/5.4/clang_64/lib/QtTest.framework/Headers -I/Users/build/Qt/5.4/clang_64/lib/QtDesigner.framework/Headers -I/Users/build/Qt/5.4/clang_64/lib/QtXml.framework/Headers -I/Users/build/Qt/5.4/clang_64/lib/QtConcurrent.framework/Headers -I/Users/build/Qt/5.4/clang_64/lib/QtXmlPatterns.framework/Headers -I/Users/build/Qt/5.4/clang_64/include -I/Users/build/Qt/5.4/clang_64/include/QtUiTools -I/Users/build/Qt/5.4/clang_64/lib/QtQml.framework/Headers -I/Users/build/Qt/5.4/clang_64/lib/QtQuick.framework/Headers -I/Users/build/Qt/5.4/clang_64/lib/QtQuickWidgets.framework/Headers -I/Users/build/Qt/5.4/clang_64/lib/QtWebKit.framework/Headers -I/Users/build/Qt/5.4/clang_64/lib/QtWebKitWidgets.framework/Headers -I/Users/build/Qt/5.4/clang_64/lib/QtSql.framework/Headers -I/Users/build/Qt/5.4/clang_64/lib/QtOpenGL.framework/Headers -I/Users/build/MuseScore -I/Users/build/MuseScore/build.release -I/usr/local/Cellar/jack/0.124.1/include -I/usr/local/Cellar/portaudio/19.20140130/include -I/usr/local/Cellar/libogg/1.3.2/include -I/usr/local/Cellar/libvorbis/1.3.4/include -I/usr/local/Cellar/libsndfile/1.0.25/include -I/usr/local/include -I/Users/build/MuseScore/build.release/awl/mscore.build/Release/awl.build/DerivedSources/x86_64 -I/Users/build/MuseScore/build.release/awl/mscore.build/Release/awl.build/DerivedSources -Wmost -Wno-four-char-constants -Wno-unknown-pragmas -F/Users/build/MuseScore/build.release/awl/Release -F/Users/build/Qt/5.4/clang_64/lib -std=c++0x -fPIC -stdlib=libc++ -DNDEBUG -DQT_NO_DEBUG -Wall -Wextra -Winvalid-pch -include /var/folders/_p/zg2h1pkn3vx5ngw4dfy7nbcr0000gn/C/com.apple.DeveloperTools/6.1.1-6A2008a/Xcode/SharedPrecompiledHeaders/all-ckqeeqmjhoqfpwcahcuhqhmyqwix/all.h -MMD -MT dependencies -MF /Users/build/MuseScore/build.release/awl/mscore.build/Release/awl.build/Objects-normal/x86_64/colorlabel.d --serialize-diagnostics /Users/build/MuseScore/build.release/awl/mscore.build/Release/awl.build/Objects-normal/x86_64/colorlabel.dia -c /Users/build/MuseScore/awl/colorlabel.cpp -o /Users/build/MuseScore/build.release/awl/mscore.build/Release/awl.build/Objects-normal/x86_64/colorlabel.o

CompileC build.release/awl/mscore.build/Release/awl.build/Objects-normal/x86_64/denomspinbox.o awl/denomspinbox.cpp normal x86_64 c++ com.apple.compilers.llvm.clang.1_0.compiler
    cd /Users/build/MuseScore
    export LANG=en_US.US-ASCII
    /Applications/Xcode.app/Contents/Developer/Toolchains/XcodeDefault.xctoolchain/usr/bin/clang -x c++ -arch x86_64 -fmessage-length=80 -fdiagnostics-show-note-include-stack -fmacro-backtrace-limit=0 -fcolor-diagnostics -Wno-trigraphs -fpascal-strings -O2 -Wno-missing-field-initializers -Wno-missing-prototypes -Wno-return-type -Wno-non-virtual-dtor -Wno-overloaded-virtual -Wno-exit-time-destructors -Wno-missing-braces -Wparentheses -Wswitch -Wno-unused-function -Wno-unused-label -Wno-unused-parameter -Wno-unused-variable -Wunused-value -Wno-empty-body -Wno-uninitialized -Wno-unknown-pragmas -Wno-shadow -Wno-four-char-constants -Wno-conversion -Wno-constant-conversion -Wno-int-conversion -Wno-bool-conversion -Wno-enum-conversion -Wno-shorten-64-to-32 -Wno-newline-eof -Wno-c++11-extensions -DCMAKE_INTDIR=\"Release\" -DQT_DISABLE_DEPRECATED_BEFORE=0 -isysroot /Applications/Xcode.app/Contents/Developer/Platforms/MacOSX.platform/Developer/SDKs/MacOSX10.10.sdk -fasm-blocks -fstrict-aliasing -Wdeprecated-declarations -Winvalid-offsetof -mmacosx-version-min=10.7 -g -Wno-sign-conversion -I/Users/build/MuseScore/build.release/awl/Release/include -I/Users/build/MuseScore/build.release/awl -I/Users/build/MuseScore/awl -I/Users/build/Qt/5.4/clang_64/lib/QtGui.framework/Headers -I/Users/build/Qt/5.4/clang_64/lib/QtCore.framework/Headers -I/Users/build/Qt/5.4/clang_64/mkspecs/macx-clang -I/Applications/Xcode.app/Contents/Developer/Platforms/MacOSX.platform/Developer/SDKs/MacOSX10.10.sdk/System/Library/Frameworks/OpenGL.framework/Headers -I/Users/build/Qt/5.4/clang_64/lib/QtWidgets.framework/Headers -I/Users/build/Qt/5.4/clang_64/lib/QtPrintSupport.framework/Headers -I/Users/build/Qt/5.4/clang_64/lib/QtSvg.framework/Headers -I/Users/build/Qt/5.4/clang_64/lib/QtDeclarative.framework/Headers -I/Users/build/Qt/5.4/clang_64/lib/QtScript.framework/Headers -I/Users/build/Qt/5.4/clang_64/lib/QtScriptTools.framework/Headers -I/Users/build/Qt/5.4/clang_64/lib/QtNetwork.framework/Headers -I/Users/build/Qt/5.4/clang_64/lib/QtTest.framework/Headers -I/Users/build/Qt/5.4/clang_64/lib/QtDesigner.framework/Headers -I/Users/build/Qt/5.4/clang_64/lib/QtXml.framework/Headers -I/Users/build/Qt/5.4/clang_64/lib/QtConcurrent.framework/Headers -I/Users/build/Qt/5.4/clang_64/lib/QtXmlPatterns.framework/Headers -I/Users/build/Qt/5.4/clang_64/include -I/Users/build/Qt/5.4/clang_64/include/QtUiTools -I/Users/build/Qt/5.4/clang_64/lib/QtQml.framework/Headers -I/Users/build/Qt/5.4/clang_64/lib/QtQuick.framework/Headers -I/Users/build/Qt/5.4/clang_64/lib/QtQuickWidgets.framework/Headers -I/Users/build/Qt/5.4/clang_64/lib/QtWebKit.framework/Headers -I/Users/build/Qt/5.4/clang_64/lib/QtWebKitWidgets.framework/Headers -I/Users/build/Qt/5.4/clang_64/lib/QtSql.framework/Headers -I/Users/build/Qt/5.4/clang_64/lib/QtOpenGL.framework/Headers -I/Users/build/MuseScore -I/Users/build/MuseScore/build.release -I/usr/local/Cellar/jack/0.124.1/include -I/usr/local/Cellar/portaudio/19.20140130/include -I/usr/local/Cellar/libogg/1.3.2/include -I/usr/local/Cellar/libvorbis/1.3.4/include -I/usr/local/Cellar/libsndfile/1.0.25/include -I/usr/local/include -I/Users/build/MuseScore/build.release/awl/mscore.build/Release/awl.build/DerivedSources/x86_64 -I/Users/build/MuseScore/build.release/awl/mscore.build/Release/awl.build/DerivedSources -Wmost -Wno-four-char-constants -Wno-unknown-pragmas -F/Users/build/MuseScore/build.release/awl/Release -F/Users/build/Qt/5.4/clang_64/lib -std=c++0x -fPIC -stdlib=libc++ -DNDEBUG -DQT_NO_DEBUG -Wall -Wextra -Winvalid-pch -include /var/folders/_p/zg2h1pkn3vx5ngw4dfy7nbcr0000gn/C/com.apple.DeveloperTools/6.1.1-6A2008a/Xcode/SharedPrecompiledHeaders/all-ckqeeqmjhoqfpwcahcuhqhmyqwix/all.h -MMD -MT dependencies -MF /Users/build/MuseScore/build.release/awl/mscore.build/Release/awl.build/Objects-normal/x86_64/denomspinbox.d --serialize-diagnostics /Users/build/MuseScore/build.release/awl/mscore.build/Release/awl.build/Objects-normal/x86_64/denomspinbox.dia -c /Users/build/MuseScore/awl/denomspinbox.cpp -o /Users/build/MuseScore/build.release/awl/mscore.build/Release/awl.build/Objects-normal/x86_64/denomspinbox.o

CompileC build.release/awl/mscore.build/Release/awl.build/Objects-normal/x86_64/knob.o awl/knob.cpp normal x86_64 c++ com.apple.compilers.llvm.clang.1_0.compiler
    cd /Users/build/MuseScore
    export LANG=en_US.US-ASCII
    /Applications/Xcode.app/Contents/Developer/Toolchains/XcodeDefault.xctoolchain/usr/bin/clang -x c++ -arch x86_64 -fmessage-length=80 -fdiagnostics-show-note-include-stack -fmacro-backtrace-limit=0 -fcolor-diagnostics -Wno-trigraphs -fpascal-strings -O2 -Wno-missing-field-initializers -Wno-missing-prototypes -Wno-return-type -Wno-non-virtual-dtor -Wno-overloaded-virtual -Wno-exit-time-destructors -Wno-missing-braces -Wparentheses -Wswitch -Wno-unused-function -Wno-unused-label -Wno-unused-parameter -Wno-unused-variable -Wunused-value -Wno-empty-body -Wno-uninitialized -Wno-unknown-pragmas -Wno-shadow -Wno-four-char-constants -Wno-conversion -Wno-constant-conversion -Wno-int-conversion -Wno-bool-conversion -Wno-enum-conversion -Wno-shorten-64-to-32 -Wno-newline-eof -Wno-c++11-extensions -DCMAKE_INTDIR=\"Release\" -DQT_DISABLE_DEPRECATED_BEFORE=0 -isysroot /Applications/Xcode.app/Contents/Developer/Platforms/MacOSX.platform/Developer/SDKs/MacOSX10.10.sdk -fasm-blocks -fstrict-aliasing -Wdeprecated-declarations -Winvalid-offsetof -mmacosx-version-min=10.7 -g -Wno-sign-conversion -I/Users/build/MuseScore/build.release/awl/Release/include -I/Users/build/MuseScore/build.release/awl -I/Users/build/MuseScore/awl -I/Users/build/Qt/5.4/clang_64/lib/QtGui.framework/Headers -I/Users/build/Qt/5.4/clang_64/lib/QtCore.framework/Headers -I/Users/build/Qt/5.4/clang_64/mkspecs/macx-clang -I/Applications/Xcode.app/Contents/Developer/Platforms/MacOSX.platform/Developer/SDKs/MacOSX10.10.sdk/System/Library/Frameworks/OpenGL.framework/Headers -I/Users/build/Qt/5.4/clang_64/lib/QtWidgets.framework/Headers -I/Users/build/Qt/5.4/clang_64/lib/QtPrintSupport.framework/Headers -I/Users/build/Qt/5.4/clang_64/lib/QtSvg.framework/Headers -I/Users/build/Qt/5.4/clang_64/lib/QtDeclarative.framework/Headers -I/Users/build/Qt/5.4/clang_64/lib/QtScript.framework/Headers -I/Users/build/Qt/5.4/clang_64/lib/QtScriptTools.framework/Headers -I/Users/build/Qt/5.4/clang_64/lib/QtNetwork.framework/Headers -I/Users/build/Qt/5.4/clang_64/lib/QtTest.framework/Headers -I/Users/build/Qt/5.4/clang_64/lib/QtDesigner.framework/Headers -I/Users/build/Qt/5.4/clang_64/lib/QtXml.framework/Headers -I/Users/build/Qt/5.4/clang_64/lib/QtConcurrent.framework/Headers -I/Users/build/Qt/5.4/clang_64/lib/QtXmlPatterns.framework/Headers -I/Users/build/Qt/5.4/clang_64/include -I/Users/build/Qt/5.4/clang_64/include/QtUiTools -I/Users/build/Qt/5.4/clang_64/lib/QtQml.framework/Headers -I/Users/build/Qt/5.4/clang_64/lib/QtQuick.framework/Headers -I/Users/build/Qt/5.4/clang_64/lib/QtQuickWidgets.framework/Headers -I/Users/build/Qt/5.4/clang_64/lib/QtWebKit.framework/Headers -I/Users/build/Qt/5.4/clang_64/lib/QtWebKitWidgets.framework/Headers -I/Users/build/Qt/5.4/clang_64/lib/QtSql.framework/Headers -I/Users/build/Qt/5.4/clang_64/lib/QtOpenGL.framework/Headers -I/Users/build/MuseScore -I/Users/build/MuseScore/build.release -I/usr/local/Cellar/jack/0.124.1/include -I/usr/local/Cellar/portaudio/19.20140130/include -I/usr/local/Cellar/libogg/1.3.2/include -I/usr/local/Cellar/libvorbis/1.3.4/include -I/usr/local/Cellar/libsndfile/1.0.25/include -I/usr/local/include -I/Users/build/MuseScore/build.release/awl/mscore.build/Release/awl.build/DerivedSources/x86_64 -I/Users/build/MuseScore/build.release/awl/mscore.build/Release/awl.build/DerivedSources -Wmost -Wno-four-char-constants -Wno-unknown-pragmas -F/Users/build/MuseScore/build.release/awl/Release -F/Users/build/Qt/5.4/clang_64/lib -std=c++0x -fPIC -stdlib=libc++ -DNDEBUG -DQT_NO_DEBUG -Wall -Wextra -Winvalid-pch -include /var/folders/_p/zg2h1pkn3vx5ngw4dfy7nbcr0000gn/C/com.apple.DeveloperTools/6.1.1-6A2008a/Xcode/SharedPrecompiledHeaders/all-ckqeeqmjhoqfpwcahcuhqhmyqwix/all.h -MMD -MT dependencies -MF /Users/build/MuseScore/build.release/awl/mscore.build/Release/awl.build/Objects-normal/x86_64/knob.d --serialize-diagnostics /Users/build/MuseScore/build.release/awl/mscore.build/Release/awl.build/Objects-normal/x86_64/knob.dia -c /Users/build/MuseScore/awl/knob.cpp -o /Users/build/MuseScore/build.release/awl/mscore.build/Release/awl.build/Objects-normal/x86_64/knob.o

CompileC build.release/awl/mscore.build/Release/awl.build/Objects-normal/x86_64/midipanknob.o awl/midipanknob.cpp normal x86_64 c++ com.apple.compilers.llvm.clang.1_0.compiler
    cd /Users/build/MuseScore
    export LANG=en_US.US-ASCII
    /Applications/Xcode.app/Contents/Developer/Toolchains/XcodeDefault.xctoolchain/usr/bin/clang -x c++ -arch x86_64 -fmessage-length=80 -fdiagnostics-show-note-include-stack -fmacro-backtrace-limit=0 -fcolor-diagnostics -Wno-trigraphs -fpascal-strings -O2 -Wno-missing-field-initializers -Wno-missing-prototypes -Wno-return-type -Wno-non-virtual-dtor -Wno-overloaded-virtual -Wno-exit-time-destructors -Wno-missing-braces -Wparentheses -Wswitch -Wno-unused-function -Wno-unused-label -Wno-unused-parameter -Wno-unused-variable -Wunused-value -Wno-empty-body -Wno-uninitialized -Wno-unknown-pragmas -Wno-shadow -Wno-four-char-constants -Wno-conversion -Wno-constant-conversion -Wno-int-conversion -Wno-bool-conversion -Wno-enum-conversion -Wno-shorten-64-to-32 -Wno-newline-eof -Wno-c++11-extensions -DCMAKE_INTDIR=\"Release\" -DQT_DISABLE_DEPRECATED_BEFORE=0 -isysroot /Applications/Xcode.app/Contents/Developer/Platforms/MacOSX.platform/Developer/SDKs/MacOSX10.10.sdk -fasm-blocks -fstrict-aliasing -Wdeprecated-declarations -Winvalid-offsetof -mmacosx-version-min=10.7 -g -Wno-sign-conversion -I/Users/build/MuseScore/build.release/awl/Release/include -I/Users/build/MuseScore/build.release/awl -I/Users/build/MuseScore/awl -I/Users/build/Qt/5.4/clang_64/lib/QtGui.framework/Headers -I/Users/build/Qt/5.4/clang_64/lib/QtCore.framework/Headers -I/Users/build/Qt/5.4/clang_64/mkspecs/macx-clang -I/Applications/Xcode.app/Contents/Developer/Platforms/MacOSX.platform/Developer/SDKs/MacOSX10.10.sdk/System/Library/Frameworks/OpenGL.framework/Headers -I/Users/build/Qt/5.4/clang_64/lib/QtWidgets.framework/Headers -I/Users/build/Qt/5.4/clang_64/lib/QtPrintSupport.framework/Headers -I/Users/build/Qt/5.4/clang_64/lib/QtSvg.framework/Headers -I/Users/build/Qt/5.4/clang_64/lib/QtDeclarative.framework/Headers -I/Users/build/Qt/5.4/clang_64/lib/QtScript.framework/Headers -I/Users/build/Qt/5.4/clang_64/lib/QtScriptTools.framework/Headers -I/Users/build/Qt/5.4/clang_64/lib/QtNetwork.framework/Headers -I/Users/build/Qt/5.4/clang_64/lib/QtTest.framework/Headers -I/Users/build/Qt/5.4/clang_64/lib/QtDesigner.framework/Headers -I/Users/build/Qt/5.4/clang_64/lib/QtXml.framework/Headers -I/Users/build/Qt/5.4/clang_64/lib/QtConcurrent.framework/Headers -I/Users/build/Qt/5.4/clang_64/lib/QtXmlPatterns.framework/Headers -I/Users/build/Qt/5.4/clang_64/include -I/Users/build/Qt/5.4/clang_64/include/QtUiTools -I/Users/build/Qt/5.4/clang_64/lib/QtQml.framework/Headers -I/Users/build/Qt/5.4/clang_64/lib/QtQuick.framework/Headers -I/Users/build/Qt/5.4/clang_64/lib/QtQuickWidgets.framework/Headers -I/Users/build/Qt/5.4/clang_64/lib/QtWebKit.framework/Headers -I/Users/build/Qt/5.4/clang_64/lib/QtWebKitWidgets.framework/Headers -I/Users/build/Qt/5.4/clang_64/lib/QtSql.framework/Headers -I/Users/build/Qt/5.4/clang_64/lib/QtOpenGL.framework/Headers -I/Users/build/MuseScore -I/Users/build/MuseScore/build.release -I/usr/local/Cellar/jack/0.124.1/include -I/usr/local/Cellar/portaudio/19.20140130/include -I/usr/local/Cellar/libogg/1.3.2/include -I/usr/local/Cellar/libvorbis/1.3.4/include -I/usr/local/Cellar/libsndfile/1.0.25/include -I/usr/local/include -I/Users/build/MuseScore/build.release/awl/mscore.build/Release/awl.build/DerivedSources/x86_64 -I/Users/build/MuseScore/build.release/awl/mscore.build/Release/awl.build/DerivedSources -Wmost -Wno-four-char-constants -Wno-unknown-pragmas -F/Users/build/MuseScore/build.release/awl/Release -F/Users/build/Qt/5.4/clang_64/lib -std=c++0x -fPIC -stdlib=libc++ -DNDEBUG -DQT_NO_DEBUG -Wall -Wextra -Winvalid-pch -include /var/folders/_p/zg2h1pkn3vx5ngw4dfy7nbcr0000gn/C/com.apple.DeveloperTools/6.1.1-6A2008a/Xcode/SharedPrecompiledHeaders/all-ckqeeqmjhoqfpwcahcuhqhmyqwix/all.h -MMD -MT dependencies -MF /Users/build/MuseScore/build.release/awl/mscore.build/Release/awl.build/Objects-normal/x86_64/midipanknob.d --serialize-diagnostics /Users/build/MuseScore/build.release/awl/mscore.build/Release/awl.build/Objects-normal/x86_64/midipanknob.dia -c /Users/build/MuseScore/awl/midipanknob.cpp -o /Users/build/MuseScore/build.release/awl/mscore.build/Release/awl.build/Objects-normal/x86_64/midipanknob.o

CompileC build.release/awl/mscore.build/Release/awl.build/Objects-normal/x86_64/mslider.o awl/mslider.cpp normal x86_64 c++ com.apple.compilers.llvm.clang.1_0.compiler
    cd /Users/build/MuseScore
    export LANG=en_US.US-ASCII
    /Applications/Xcode.app/Contents/Developer/Toolchains/XcodeDefault.xctoolchain/usr/bin/clang -x c++ -arch x86_64 -fmessage-length=80 -fdiagnostics-show-note-include-stack -fmacro-backtrace-limit=0 -fcolor-diagnostics -Wno-trigraphs -fpascal-strings -O2 -Wno-missing-field-initializers -Wno-missing-prototypes -Wno-return-type -Wno-non-virtual-dtor -Wno-overloaded-virtual -Wno-exit-time-destructors -Wno-missing-braces -Wparentheses -Wswitch -Wno-unused-function -Wno-unused-label -Wno-unused-parameter -Wno-unused-variable -Wunused-value -Wno-empty-body -Wno-uninitialized -Wno-unknown-pragmas -Wno-shadow -Wno-four-char-constants -Wno-conversion -Wno-constant-conversion -Wno-int-conversion -Wno-bool-conversion -Wno-enum-conversion -Wno-shorten-64-to-32 -Wno-newline-eof -Wno-c++11-extensions -DCMAKE_INTDIR=\"Release\" -DQT_DISABLE_DEPRECATED_BEFORE=0 -isysroot /Applications/Xcode.app/Contents/Developer/Platforms/MacOSX.platform/Developer/SDKs/MacOSX10.10.sdk -fasm-blocks -fstrict-aliasing -Wdeprecated-declarations -Winvalid-offsetof -mmacosx-version-min=10.7 -g -Wno-sign-conversion -I/Users/build/MuseScore/build.release/awl/Release/include -I/Users/build/MuseScore/build.release/awl -I/Users/build/MuseScore/awl -I/Users/build/Qt/5.4/clang_64/lib/QtGui.framework/Headers -I/Users/build/Qt/5.4/clang_64/lib/QtCore.framework/Headers -I/Users/build/Qt/5.4/clang_64/mkspecs/macx-clang -I/Applications/Xcode.app/Contents/Developer/Platforms/MacOSX.platform/Developer/SDKs/MacOSX10.10.sdk/System/Library/Frameworks/OpenGL.framework/Headers -I/Users/build/Qt/5.4/clang_64/lib/QtWidgets.framework/Headers -I/Users/build/Qt/5.4/clang_64/lib/QtPrintSupport.framework/Headers -I/Users/build/Qt/5.4/clang_64/lib/QtSvg.framework/Headers -I/Users/build/Qt/5.4/clang_64/lib/QtDeclarative.framework/Headers -I/Users/build/Qt/5.4/clang_64/lib/QtScript.framework/Headers -I/Users/build/Qt/5.4/clang_64/lib/QtScriptTools.framework/Headers -I/Users/build/Qt/5.4/clang_64/lib/QtNetwork.framework/Headers -I/Users/build/Qt/5.4/clang_64/lib/QtTest.framework/Headers -I/Users/build/Qt/5.4/clang_64/lib/QtDesigner.framework/Headers -I/Users/build/Qt/5.4/clang_64/lib/QtXml.framework/Headers -I/Users/build/Qt/5.4/clang_64/lib/QtConcurrent.framework/Headers -I/Users/build/Qt/5.4/clang_64/lib/QtXmlPatterns.framework/Headers -I/Users/build/Qt/5.4/clang_64/include -I/Users/build/Qt/5.4/clang_64/include/QtUiTools -I/Users/build/Qt/5.4/clang_64/lib/QtQml.framework/Headers -I/Users/build/Qt/5.4/clang_64/lib/QtQuick.framework/Headers -I/Users/build/Qt/5.4/clang_64/lib/QtQuickWidgets.framework/Headers -I/Users/build/Qt/5.4/clang_64/lib/QtWebKit.framework/Headers -I/Users/build/Qt/5.4/clang_64/lib/QtWebKitWidgets.framework/Headers -I/Users/build/Qt/5.4/clang_64/lib/QtSql.framework/Headers -I/Users/build/Qt/5.4/clang_64/lib/QtOpenGL.framework/Headers -I/Users/build/MuseScore -I/Users/build/MuseScore/build.release -I/usr/local/Cellar/jack/0.124.1/include -I/usr/local/Cellar/portaudio/19.20140130/include -I/usr/local/Cellar/libogg/1.3.2/include -I/usr/local/Cellar/libvorbis/1.3.4/include -I/usr/local/Cellar/libsndfile/1.0.25/include -I/usr/local/include -I/Users/build/MuseScore/build.release/awl/mscore.build/Release/awl.build/DerivedSources/x86_64 -I/Users/build/MuseScore/build.release/awl/mscore.build/Release/awl.build/DerivedSources -Wmost -Wno-four-char-constants -Wno-unknown-pragmas -F/Users/build/MuseScore/build.release/awl/Release -F/Users/build/Qt/5.4/clang_64/lib -std=c++0x -fPIC -stdlib=libc++ -DNDEBUG -DQT_NO_DEBUG -Wall -Wextra -Winvalid-pch -include /var/folders/_p/zg2h1pkn3vx5ngw4dfy7nbcr0000gn/C/com.apple.DeveloperTools/6.1.1-6A2008a/Xcode/SharedPrecompiledHeaders/all-ckqeeqmjhoqfpwcahcuhqhmyqwix/all.h -MMD -MT dependencies -MF /Users/build/MuseScore/build.release/awl/mscore.build/Release/awl.build/Objects-normal/x86_64/mslider.d --serialize-diagnostics /Users/build/MuseScore/build.release/awl/mscore.build/Release/awl.build/Objects-normal/x86_64/mslider.dia -c /Users/build/MuseScore/awl/mslider.cpp -o /Users/build/MuseScore/build.release/awl/mscore.build/Release/awl.build/Objects-normal/x86_64/mslider.o

CompileC build.release/awl/mscore.build/Release/awl.build/Objects-normal/x86_64/panknob.o awl/panknob.cpp normal x86_64 c++ com.apple.compilers.llvm.clang.1_0.compiler
    cd /Users/build/MuseScore
    export LANG=en_US.US-ASCII
    /Applications/Xcode.app/Contents/Developer/Toolchains/XcodeDefault.xctoolchain/usr/bin/clang -x c++ -arch x86_64 -fmessage-length=80 -fdiagnostics-show-note-include-stack -fmacro-backtrace-limit=0 -fcolor-diagnostics -Wno-trigraphs -fpascal-strings -O2 -Wno-missing-field-initializers -Wno-missing-prototypes -Wno-return-type -Wno-non-virtual-dtor -Wno-overloaded-virtual -Wno-exit-time-destructors -Wno-missing-braces -Wparentheses -Wswitch -Wno-unused-function -Wno-unused-label -Wno-unused-parameter -Wno-unused-variable -Wunused-value -Wno-empty-body -Wno-uninitialized -Wno-unknown-pragmas -Wno-shadow -Wno-four-char-constants -Wno-conversion -Wno-constant-conversion -Wno-int-conversion -Wno-bool-conversion -Wno-enum-conversion -Wno-shorten-64-to-32 -Wno-newline-eof -Wno-c++11-extensions -DCMAKE_INTDIR=\"Release\" -DQT_DISABLE_DEPRECATED_BEFORE=0 -isysroot /Applications/Xcode.app/Contents/Developer/Platforms/MacOSX.platform/Developer/SDKs/MacOSX10.10.sdk -fasm-blocks -fstrict-aliasing -Wdeprecated-declarations -Winvalid-offsetof -mmacosx-version-min=10.7 -g -Wno-sign-conversion -I/Users/build/MuseScore/build.release/awl/Release/include -I/Users/build/MuseScore/build.release/awl -I/Users/build/MuseScore/awl -I/Users/build/Qt/5.4/clang_64/lib/QtGui.framework/Headers -I/Users/build/Qt/5.4/clang_64/lib/QtCore.framework/Headers -I/Users/build/Qt/5.4/clang_64/mkspecs/macx-clang -I/Applications/Xcode.app/Contents/Developer/Platforms/MacOSX.platform/Developer/SDKs/MacOSX10.10.sdk/System/Library/Frameworks/OpenGL.framework/Headers -I/Users/build/Qt/5.4/clang_64/lib/QtWidgets.framework/Headers -I/Users/build/Qt/5.4/clang_64/lib/QtPrintSupport.framework/Headers -I/Users/build/Qt/5.4/clang_64/lib/QtSvg.framework/Headers -I/Users/build/Qt/5.4/clang_64/lib/QtDeclarative.framework/Headers -I/Users/build/Qt/5.4/clang_64/lib/QtScript.framework/Headers -I/Users/build/Qt/5.4/clang_64/lib/QtScriptTools.framework/Headers -I/Users/build/Qt/5.4/clang_64/lib/QtNetwork.framework/Headers -I/Users/build/Qt/5.4/clang_64/lib/QtTest.framework/Headers -I/Users/build/Qt/5.4/clang_64/lib/QtDesigner.framework/Headers -I/Users/build/Qt/5.4/clang_64/lib/QtXml.framework/Headers -I/Users/build/Qt/5.4/clang_64/lib/QtConcurrent.framework/Headers -I/Users/build/Qt/5.4/clang_64/lib/QtXmlPatterns.framework/Headers -I/Users/build/Qt/5.4/clang_64/include -I/Users/build/Qt/5.4/clang_64/include/QtUiTools -I/Users/build/Qt/5.4/clang_64/lib/QtQml.framework/Headers -I/Users/build/Qt/5.4/clang_64/lib/QtQuick.framework/Headers -I/Users/build/Qt/5.4/clang_64/lib/QtQuickWidgets.framework/Headers -I/Users/build/Qt/5.4/clang_64/lib/QtWebKit.framework/Headers -I/Users/build/Qt/5.4/clang_64/lib/QtWebKitWidgets.framework/Headers -I/Users/build/Qt/5.4/clang_64/lib/QtSql.framework/Headers -I/Users/build/Qt/5.4/clang_64/lib/QtOpenGL.framework/Headers -I/Users/build/MuseScore -I/Users/build/MuseScore/build.release -I/usr/local/Cellar/jack/0.124.1/include -I/usr/local/Cellar/portaudio/19.20140130/include -I/usr/local/Cellar/libogg/1.3.2/include -I/usr/local/Cellar/libvorbis/1.3.4/include -I/usr/local/Cellar/libsndfile/1.0.25/include -I/usr/local/include -I/Users/build/MuseScore/build.release/awl/mscore.build/Release/awl.build/DerivedSources/x86_64 -I/Users/build/MuseScore/build.release/awl/mscore.build/Release/awl.build/DerivedSources -Wmost -Wno-four-char-constants -Wno-unknown-pragmas -F/Users/build/MuseScore/build.release/awl/Release -F/Users/build/Qt/5.4/clang_64/lib -std=c++0x -fPIC -stdlib=libc++ -DNDEBUG -DQT_NO_DEBUG -Wall -Wextra -Winvalid-pch -include /var/folders/_p/zg2h1pkn3vx5ngw4dfy7nbcr0000gn/C/com.apple.DeveloperTools/6.1.1-6A2008a/Xcode/SharedPrecompiledHeaders/all-ckqeeqmjhoqfpwcahcuhqhmyqwix/all.h -MMD -MT dependencies -MF /Users/build/MuseScore/build.release/awl/mscore.build/Release/awl.build/Objects-normal/x86_64/panknob.d --serialize-diagnostics /Users/build/MuseScore/build.release/awl/mscore.build/Release/awl.build/Objects-normal/x86_64/panknob.dia -c /Users/build/MuseScore/awl/panknob.cpp -o /Users/build/MuseScore/build.release/awl/mscore.build/Release/awl.build/Objects-normal/x86_64/panknob.o

CompileC build.release/awl/mscore.build/Release/awl.build/Objects-normal/x86_64/pitchedit.o awl/pitchedit.cpp normal x86_64 c++ com.apple.compilers.llvm.clang.1_0.compiler
    cd /Users/build/MuseScore
    export LANG=en_US.US-ASCII
    /Applications/Xcode.app/Contents/Developer/Toolchains/XcodeDefault.xctoolchain/usr/bin/clang -x c++ -arch x86_64 -fmessage-length=80 -fdiagnostics-show-note-include-stack -fmacro-backtrace-limit=0 -fcolor-diagnostics -Wno-trigraphs -fpascal-strings -O2 -Wno-missing-field-initializers -Wno-missing-prototypes -Wno-return-type -Wno-non-virtual-dtor -Wno-overloaded-virtual -Wno-exit-time-destructors -Wno-missing-braces -Wparentheses -Wswitch -Wno-unused-function -Wno-unused-label -Wno-unused-parameter -Wno-unused-variable -Wunused-value -Wno-empty-body -Wno-uninitialized -Wno-unknown-pragmas -Wno-shadow -Wno-four-char-constants -Wno-conversion -Wno-constant-conversion -Wno-int-conversion -Wno-bool-conversion -Wno-enum-conversion -Wno-shorten-64-to-32 -Wno-newline-eof -Wno-c++11-extensions -DCMAKE_INTDIR=\"Release\" -DQT_DISABLE_DEPRECATED_BEFORE=0 -isysroot /Applications/Xcode.app/Contents/Developer/Platforms/MacOSX.platform/Developer/SDKs/MacOSX10.10.sdk -fasm-blocks -fstrict-aliasing -Wdeprecated-declarations -Winvalid-offsetof -mmacosx-version-min=10.7 -g -Wno-sign-conversion -I/Users/build/MuseScore/build.release/awl/Release/include -I/Users/build/MuseScore/build.release/awl -I/Users/build/MuseScore/awl -I/Users/build/Qt/5.4/clang_64/lib/QtGui.framework/Headers -I/Users/build/Qt/5.4/clang_64/lib/QtCore.framework/Headers -I/Users/build/Qt/5.4/clang_64/mkspecs/macx-clang -I/Applications/Xcode.app/Contents/Developer/Platforms/MacOSX.platform/Developer/SDKs/MacOSX10.10.sdk/System/Library/Frameworks/OpenGL.framework/Headers -I/Users/build/Qt/5.4/clang_64/lib/QtWidgets.framework/Headers -I/Users/build/Qt/5.4/clang_64/lib/QtPrintSupport.framework/Headers -I/Users/build/Qt/5.4/clang_64/lib/QtSvg.framework/Headers -I/Users/build/Qt/5.4/clang_64/lib/QtDeclarative.framework/Headers -I/Users/build/Qt/5.4/clang_64/lib/QtScript.framework/Headers -I/Users/build/Qt/5.4/clang_64/lib/QtScriptTools.framework/Headers -I/Users/build/Qt/5.4/clang_64/lib/QtNetwork.framework/Headers -I/Users/build/Qt/5.4/clang_64/lib/QtTest.framework/Headers -I/Users/build/Qt/5.4/clang_64/lib/QtDesigner.framework/Headers -I/Users/build/Qt/5.4/clang_64/lib/QtXml.framework/Headers -I/Users/build/Qt/5.4/clang_64/lib/QtConcurrent.framework/Headers -I/Users/build/Qt/5.4/clang_64/lib/QtXmlPatterns.framework/Headers -I/Users/build/Qt/5.4/clang_64/include -I/Users/build/Qt/5.4/clang_64/include/QtUiTools -I/Users/build/Qt/5.4/clang_64/lib/QtQml.framework/Headers -I/Users/build/Qt/5.4/clang_64/lib/QtQuick.framework/Headers -I/Users/build/Qt/5.4/clang_64/lib/QtQuickWidgets.framework/Headers -I/Users/build/Qt/5.4/clang_64/lib/QtWebKit.framework/Headers -I/Users/build/Qt/5.4/clang_64/lib/QtWebKitWidgets.framework/Headers -I/Users/build/Qt/5.4/clang_64/lib/QtSql.framework/Headers -I/Users/build/Qt/5.4/clang_64/lib/QtOpenGL.framework/Headers -I/Users/build/MuseScore -I/Users/build/MuseScore/build.release -I/usr/local/Cellar/jack/0.124.1/include -I/usr/local/Cellar/portaudio/19.20140130/include -I/usr/local/Cellar/libogg/1.3.2/include -I/usr/local/Cellar/libvorbis/1.3.4/include -I/usr/local/Cellar/libsndfile/1.0.25/include -I/usr/local/include -I/Users/build/MuseScore/build.release/awl/mscore.build/Release/awl.build/DerivedSources/x86_64 -I/Users/build/MuseScore/build.release/awl/mscore.build/Release/awl.build/DerivedSources -Wmost -Wno-four-char-constants -Wno-unknown-pragmas -F/Users/build/MuseScore/build.release/awl/Release -F/Users/build/Qt/5.4/clang_64/lib -std=c++0x -fPIC -stdlib=libc++ -DNDEBUG -DQT_NO_DEBUG -Wall -Wextra -Winvalid-pch -include /var/folders/_p/zg2h1pkn3vx5ngw4dfy7nbcr0000gn/C/com.apple.DeveloperTools/6.1.1-6A2008a/Xcode/SharedPrecompiledHeaders/all-ckqeeqmjhoqfpwcahcuhqhmyqwix/all.h -MMD -MT dependencies -MF /Users/build/MuseScore/build.release/awl/mscore.build/Release/awl.build/Objects-normal/x86_64/pitchedit.d --serialize-diagnostics /Users/build/MuseScore/build.release/awl/mscore.build/Release/awl.build/Objects-normal/x86_64/pitchedit.dia -c /Users/build/MuseScore/awl/pitchedit.cpp -o /Users/build/MuseScore/build.release/awl/mscore.build/Release/awl.build/Objects-normal/x86_64/pitchedit.o

CompileC build.release/awl/mscore.build/Release/awl.build/Objects-normal/x86_64/pitchlabel.o awl/pitchlabel.cpp normal x86_64 c++ com.apple.compilers.llvm.clang.1_0.compiler
    cd /Users/build/MuseScore
    export LANG=en_US.US-ASCII
    /Applications/Xcode.app/Contents/Developer/Toolchains/XcodeDefault.xctoolchain/usr/bin/clang -x c++ -arch x86_64 -fmessage-length=80 -fdiagnostics-show-note-include-stack -fmacro-backtrace-limit=0 -fcolor-diagnostics -Wno-trigraphs -fpascal-strings -O2 -Wno-missing-field-initializers -Wno-missing-prototypes -Wno-return-type -Wno-non-virtual-dtor -Wno-overloaded-virtual -Wno-exit-time-destructors -Wno-missing-braces -Wparentheses -Wswitch -Wno-unused-function -Wno-unused-label -Wno-unused-parameter -Wno-unused-variable -Wunused-value -Wno-empty-body -Wno-uninitialized -Wno-unknown-pragmas -Wno-shadow -Wno-four-char-constants -Wno-conversion -Wno-constant-conversion -Wno-int-conversion -Wno-bool-conversion -Wno-enum-conversion -Wno-shorten-64-to-32 -Wno-newline-eof -Wno-c++11-extensions -DCMAKE_INTDIR=\"Release\" -DQT_DISABLE_DEPRECATED_BEFORE=0 -isysroot /Applications/Xcode.app/Contents/Developer/Platforms/MacOSX.platform/Developer/SDKs/MacOSX10.10.sdk -fasm-blocks -fstrict-aliasing -Wdeprecated-declarations -Winvalid-offsetof -mmacosx-version-min=10.7 -g -Wno-sign-conversion -I/Users/build/MuseScore/build.release/awl/Release/include -I/Users/build/MuseScore/build.release/awl -I/Users/build/MuseScore/awl -I/Users/build/Qt/5.4/clang_64/lib/QtGui.framework/Headers -I/Users/build/Qt/5.4/clang_64/lib/QtCore.framework/Headers -I/Users/build/Qt/5.4/clang_64/mkspecs/macx-clang -I/Applications/Xcode.app/Contents/Developer/Platforms/MacOSX.platform/Developer/SDKs/MacOSX10.10.sdk/System/Library/Frameworks/OpenGL.framework/Headers -I/Users/build/Qt/5.4/clang_64/lib/QtWidgets.framework/Headers -I/Users/build/Qt/5.4/clang_64/lib/QtPrintSupport.framework/Headers -I/Users/build/Qt/5.4/clang_64/lib/QtSvg.framework/Headers -I/Users/build/Qt/5.4/clang_64/lib/QtDeclarative.framework/Headers -I/Users/build/Qt/5.4/clang_64/lib/QtScript.framework/Headers -I/Users/build/Qt/5.4/clang_64/lib/QtScriptTools.framework/Headers -I/Users/build/Qt/5.4/clang_64/lib/QtNetwork.framework/Headers -I/Users/build/Qt/5.4/clang_64/lib/QtTest.framework/Headers -I/Users/build/Qt/5.4/clang_64/lib/QtDesigner.framework/Headers -I/Users/build/Qt/5.4/clang_64/lib/QtXml.framework/Headers -I/Users/build/Qt/5.4/clang_64/lib/QtConcurrent.framework/Headers -I/Users/build/Qt/5.4/clang_64/lib/QtXmlPatterns.framework/Headers -I/Users/build/Qt/5.4/clang_64/include -I/Users/build/Qt/5.4/clang_64/include/QtUiTools -I/Users/build/Qt/5.4/clang_64/lib/QtQml.framework/Headers -I/Users/build/Qt/5.4/clang_64/lib/QtQuick.framework/Headers -I/Users/build/Qt/5.4/clang_64/lib/QtQuickWidgets.framework/Headers -I/Users/build/Qt/5.4/clang_64/lib/QtWebKit.framework/Headers -I/Users/build/Qt/5.4/clang_64/lib/QtWebKitWidgets.framework/Headers -I/Users/build/Qt/5.4/clang_64/lib/QtSql.framework/Headers -I/Users/build/Qt/5.4/clang_64/lib/QtOpenGL.framework/Headers -I/Users/build/MuseScore -I/Users/build/MuseScore/build.release -I/usr/local/Cellar/jack/0.124.1/include -I/usr/local/Cellar/portaudio/19.20140130/include -I/usr/local/Cellar/libogg/1.3.2/include -I/usr/local/Cellar/libvorbis/1.3.4/include -I/usr/local/Cellar/libsndfile/1.0.25/include -I/usr/local/include -I/Users/build/MuseScore/build.release/awl/mscore.build/Release/awl.build/DerivedSources/x86_64 -I/Users/build/MuseScore/build.release/awl/mscore.build/Release/awl.build/DerivedSources -Wmost -Wno-four-char-constants -Wno-unknown-pragmas -F/Users/build/MuseScore/build.release/awl/Release -F/Users/build/Qt/5.4/clang_64/lib -std=c++0x -fPIC -stdlib=libc++ -DNDEBUG -DQT_NO_DEBUG -Wall -Wextra -Winvalid-pch -include /var/folders/_p/zg2h1pkn3vx5ngw4dfy7nbcr0000gn/C/com.apple.DeveloperTools/6.1.1-6A2008a/Xcode/SharedPrecompiledHeaders/all-ckqeeqmjhoqfpwcahcuhqhmyqwix/all.h -MMD -MT dependencies -MF /Users/build/MuseScore/build.release/awl/mscore.build/Release/awl.build/Objects-normal/x86_64/pitchlabel.d --serialize-diagnostics /Users/build/MuseScore/build.release/awl/mscore.build/Release/awl.build/Objects-normal/x86_64/pitchlabel.dia -c /Users/build/MuseScore/awl/pitchlabel.cpp -o /Users/build/MuseScore/build.release/awl/mscore.build/Release/awl.build/Objects-normal/x86_64/pitchlabel.o

CompileC build.release/awl/mscore.build/Release/awl.build/Objects-normal/x86_64/poslabel.o awl/poslabel.cpp normal x86_64 c++ com.apple.compilers.llvm.clang.1_0.compiler
    cd /Users/build/MuseScore
    export LANG=en_US.US-ASCII
    /Applications/Xcode.app/Contents/Developer/Toolchains/XcodeDefault.xctoolchain/usr/bin/clang -x c++ -arch x86_64 -fmessage-length=80 -fdiagnostics-show-note-include-stack -fmacro-backtrace-limit=0 -fcolor-diagnostics -Wno-trigraphs -fpascal-strings -O2 -Wno-missing-field-initializers -Wno-missing-prototypes -Wno-return-type -Wno-non-virtual-dtor -Wno-overloaded-virtual -Wno-exit-time-destructors -Wno-missing-braces -Wparentheses -Wswitch -Wno-unused-function -Wno-unused-label -Wno-unused-parameter -Wno-unused-variable -Wunused-value -Wno-empty-body -Wno-uninitialized -Wno-unknown-pragmas -Wno-shadow -Wno-four-char-constants -Wno-conversion -Wno-constant-conversion -Wno-int-conversion -Wno-bool-conversion -Wno-enum-conversion -Wno-shorten-64-to-32 -Wno-newline-eof -Wno-c++11-extensions -DCMAKE_INTDIR=\"Release\" -DQT_DISABLE_DEPRECATED_BEFORE=0 -isysroot /Applications/Xcode.app/Contents/Developer/Platforms/MacOSX.platform/Developer/SDKs/MacOSX10.10.sdk -fasm-blocks -fstrict-aliasing -Wdeprecated-declarations -Winvalid-offsetof -mmacosx-version-min=10.7 -g -Wno-sign-conversion -I/Users/build/MuseScore/build.release/awl/Release/include -I/Users/build/MuseScore/build.release/awl -I/Users/build/MuseScore/awl -I/Users/build/Qt/5.4/clang_64/lib/QtGui.framework/Headers -I/Users/build/Qt/5.4/clang_64/lib/QtCore.framework/Headers -I/Users/build/Qt/5.4/clang_64/mkspecs/macx-clang -I/Applications/Xcode.app/Contents/Developer/Platforms/MacOSX.platform/Developer/SDKs/MacOSX10.10.sdk/System/Library/Frameworks/OpenGL.framework/Headers -I/Users/build/Qt/5.4/clang_64/lib/QtWidgets.framework/Headers -I/Users/build/Qt/5.4/clang_64/lib/QtPrintSupport.framework/Headers -I/Users/build/Qt/5.4/clang_64/lib/QtSvg.framework/Headers -I/Users/build/Qt/5.4/clang_64/lib/QtDeclarative.framework/Headers -I/Users/build/Qt/5.4/clang_64/lib/QtScript.framework/Headers -I/Users/build/Qt/5.4/clang_64/lib/QtScriptTools.framework/Headers -I/Users/build/Qt/5.4/clang_64/lib/QtNetwork.framework/Headers -I/Users/build/Qt/5.4/clang_64/lib/QtTest.framework/Headers -I/Users/build/Qt/5.4/clang_64/lib/QtDesigner.framework/Headers -I/Users/build/Qt/5.4/clang_64/lib/QtXml.framework/Headers -I/Users/build/Qt/5.4/clang_64/lib/QtConcurrent.framework/Headers -I/Users/build/Qt/5.4/clang_64/lib/QtXmlPatterns.framework/Headers -I/Users/build/Qt/5.4/clang_64/include -I/Users/build/Qt/5.4/clang_64/include/QtUiTools -I/Users/build/Qt/5.4/clang_64/lib/QtQml.framework/Headers -I/Users/build/Qt/5.4/clang_64/lib/QtQuick.framework/Headers -I/Users/build/Qt/5.4/clang_64/lib/QtQuickWidgets.framework/Headers -I/Users/build/Qt/5.4/clang_64/lib/QtWebKit.framework/Headers -I/Users/build/Qt/5.4/clang_64/lib/QtWebKitWidgets.framework/Headers -I/Users/build/Qt/5.4/clang_64/lib/QtSql.framework/Headers -I/Users/build/Qt/5.4/clang_64/lib/QtOpenGL.framework/Headers -I/Users/build/MuseScore -I/Users/build/MuseScore/build.release -I/usr/local/Cellar/jack/0.124.1/include -I/usr/local/Cellar/portaudio/19.20140130/include -I/usr/local/Cellar/libogg/1.3.2/include -I/usr/local/Cellar/libvorbis/1.3.4/include -I/usr/local/Cellar/libsndfile/1.0.25/include -I/usr/local/include -I/Users/build/MuseScore/build.release/awl/mscore.build/Release/awl.build/DerivedSources/x86_64 -I/Users/build/MuseScore/build.release/awl/mscore.build/Release/awl.build/DerivedSources -Wmost -Wno-four-char-constants -Wno-unknown-pragmas -F/Users/build/MuseScore/build.release/awl/Release -F/Users/build/Qt/5.4/clang_64/lib -std=c++0x -fPIC -stdlib=libc++ -DNDEBUG -DQT_NO_DEBUG -Wall -Wextra -Winvalid-pch -include /var/folders/_p/zg2h1pkn3vx5ngw4dfy7nbcr0000gn/C/com.apple.DeveloperTools/6.1.1-6A2008a/Xcode/SharedPrecompiledHeaders/all-ckqeeqmjhoqfpwcahcuhqhmyqwix/all.h -MMD -MT dependencies -MF /Users/build/MuseScore/build.release/awl/mscore.build/Release/awl.build/Objects-normal/x86_64/poslabel.d --serialize-diagnostics /Users/build/MuseScore/build.release/awl/mscore.build/Release/awl.build/Objects-normal/x86_64/poslabel.dia -c /Users/build/MuseScore/awl/poslabel.cpp -o /Users/build/MuseScore/build.release/awl/mscore.build/Release/awl.build/Objects-normal/x86_64/poslabel.o

CompileC build.release/awl/mscore.build/Release/awl.build/Objects-normal/x86_64/slider.o awl/slider.cpp normal x86_64 c++ com.apple.compilers.llvm.clang.1_0.compiler
    cd /Users/build/MuseScore
    export LANG=en_US.US-ASCII
    /Applications/Xcode.app/Contents/Developer/Toolchains/XcodeDefault.xctoolchain/usr/bin/clang -x c++ -arch x86_64 -fmessage-length=80 -fdiagnostics-show-note-include-stack -fmacro-backtrace-limit=0 -fcolor-diagnostics -Wno-trigraphs -fpascal-strings -O2 -Wno-missing-field-initializers -Wno-missing-prototypes -Wno-return-type -Wno-non-virtual-dtor -Wno-overloaded-virtual -Wno-exit-time-destructors -Wno-missing-braces -Wparentheses -Wswitch -Wno-unused-function -Wno-unused-label -Wno-unused-parameter -Wno-unused-variable -Wunused-value -Wno-empty-body -Wno-uninitialized -Wno-unknown-pragmas -Wno-shadow -Wno-four-char-constants -Wno-conversion -Wno-constant-conversion -Wno-int-conversion -Wno-bool-conversion -Wno-enum-conversion -Wno-shorten-64-to-32 -Wno-newline-eof -Wno-c++11-extensions -DCMAKE_INTDIR=\"Release\" -DQT_DISABLE_DEPRECATED_BEFORE=0 -isysroot /Applications/Xcode.app/Contents/Developer/Platforms/MacOSX.platform/Developer/SDKs/MacOSX10.10.sdk -fasm-blocks -fstrict-aliasing -Wdeprecated-declarations -Winvalid-offsetof -mmacosx-version-min=10.7 -g -Wno-sign-conversion -I/Users/build/MuseScore/build.release/awl/Release/include -I/Users/build/MuseScore/build.release/awl -I/Users/build/MuseScore/awl -I/Users/build/Qt/5.4/clang_64/lib/QtGui.framework/Headers -I/Users/build/Qt/5.4/clang_64/lib/QtCore.framework/Headers -I/Users/build/Qt/5.4/clang_64/mkspecs/macx-clang -I/Applications/Xcode.app/Contents/Developer/Platforms/MacOSX.platform/Developer/SDKs/MacOSX10.10.sdk/System/Library/Frameworks/OpenGL.framework/Headers -I/Users/build/Qt/5.4/clang_64/lib/QtWidgets.framework/Headers -I/Users/build/Qt/5.4/clang_64/lib/QtPrintSupport.framework/Headers -I/Users/build/Qt/5.4/clang_64/lib/QtSvg.framework/Headers -I/Users/build/Qt/5.4/clang_64/lib/QtDeclarative.framework/Headers -I/Users/build/Qt/5.4/clang_64/lib/QtScript.framework/Headers -I/Users/build/Qt/5.4/clang_64/lib/QtScriptTools.framework/Headers -I/Users/build/Qt/5.4/clang_64/lib/QtNetwork.framework/Headers -I/Users/build/Qt/5.4/clang_64/lib/QtTest.framework/Headers -I/Users/build/Qt/5.4/clang_64/lib/QtDesigner.framework/Headers -I/Users/build/Qt/5.4/clang_64/lib/QtXml.framework/Headers -I/Users/build/Qt/5.4/clang_64/lib/QtConcurrent.framework/Headers -I/Users/build/Qt/5.4/clang_64/lib/QtXmlPatterns.framework/Headers -I/Users/build/Qt/5.4/clang_64/include -I/Users/build/Qt/5.4/clang_64/include/QtUiTools -I/Users/build/Qt/5.4/clang_64/lib/QtQml.framework/Headers -I/Users/build/Qt/5.4/clang_64/lib/QtQuick.framework/Headers -I/Users/build/Qt/5.4/clang_64/lib/QtQuickWidgets.framework/Headers -I/Users/build/Qt/5.4/clang_64/lib/QtWebKit.framework/Headers -I/Users/build/Qt/5.4/clang_64/lib/QtWebKitWidgets.framework/Headers -I/Users/build/Qt/5.4/clang_64/lib/QtSql.framework/Headers -I/Users/build/Qt/5.4/clang_64/lib/QtOpenGL.framework/Headers -I/Users/build/MuseScore -I/Users/build/MuseScore/build.release -I/usr/local/Cellar/jack/0.124.1/include -I/usr/local/Cellar/portaudio/19.20140130/include -I/usr/local/Cellar/libogg/1.3.2/include -I/usr/local/Cellar/libvorbis/1.3.4/include -I/usr/local/Cellar/libsndfile/1.0.25/include -I/usr/local/include -I/Users/build/MuseScore/build.release/awl/mscore.build/Release/awl.build/DerivedSources/x86_64 -I/Users/build/MuseScore/build.release/awl/mscore.build/Release/awl.build/DerivedSources -Wmost -Wno-four-char-constants -Wno-unknown-pragmas -F/Users/build/MuseScore/build.release/awl/Release -F/Users/build/Qt/5.4/clang_64/lib -std=c++0x -fPIC -stdlib=libc++ -DNDEBUG -DQT_NO_DEBUG -Wall -Wextra -Winvalid-pch -include /var/folders/_p/zg2h1pkn3vx5ngw4dfy7nbcr0000gn/C/com.apple.DeveloperTools/6.1.1-6A2008a/Xcode/SharedPrecompiledHeaders/all-ckqeeqmjhoqfpwcahcuhqhmyqwix/all.h -MMD -MT dependencies -MF /Users/build/MuseScore/build.release/awl/mscore.build/Release/awl.build/Objects-normal/x86_64/slider.d --serialize-diagnostics /Users/build/MuseScore/build.release/awl/mscore.build/Release/awl.build/Objects-normal/x86_64/slider.dia -c /Users/build/MuseScore/awl/slider.cpp -o /Users/build/MuseScore/build.release/awl/mscore.build/Release/awl.build/Objects-normal/x86_64/slider.o

CompileC build.release/awl/mscore.build/Release/awl.build/Objects-normal/x86_64/utils.o awl/utils.cpp normal x86_64 c++ com.apple.compilers.llvm.clang.1_0.compiler
    cd /Users/build/MuseScore
    export LANG=en_US.US-ASCII
    /Applications/Xcode.app/Contents/Developer/Toolchains/XcodeDefault.xctoolchain/usr/bin/clang -x c++ -arch x86_64 -fmessage-length=80 -fdiagnostics-show-note-include-stack -fmacro-backtrace-limit=0 -fcolor-diagnostics -Wno-trigraphs -fpascal-strings -O2 -Wno-missing-field-initializers -Wno-missing-prototypes -Wno-return-type -Wno-non-virtual-dtor -Wno-overloaded-virtual -Wno-exit-time-destructors -Wno-missing-braces -Wparentheses -Wswitch -Wno-unused-function -Wno-unused-label -Wno-unused-parameter -Wno-unused-variable -Wunused-value -Wno-empty-body -Wno-uninitialized -Wno-unknown-pragmas -Wno-shadow -Wno-four-char-constants -Wno-conversion -Wno-constant-conversion -Wno-int-conversion -Wno-bool-conversion -Wno-enum-conversion -Wno-shorten-64-to-32 -Wno-newline-eof -Wno-c++11-extensions -DCMAKE_INTDIR=\"Release\" -DQT_DISABLE_DEPRECATED_BEFORE=0 -isysroot /Applications/Xcode.app/Contents/Developer/Platforms/MacOSX.platform/Developer/SDKs/MacOSX10.10.sdk -fasm-blocks -fstrict-aliasing -Wdeprecated-declarations -Winvalid-offsetof -mmacosx-version-min=10.7 -g -Wno-sign-conversion -I/Users/build/MuseScore/build.release/awl/Release/include -I/Users/build/MuseScore/build.release/awl -I/Users/build/MuseScore/awl -I/Users/build/Qt/5.4/clang_64/lib/QtGui.framework/Headers -I/Users/build/Qt/5.4/clang_64/lib/QtCore.framework/Headers -I/Users/build/Qt/5.4/clang_64/mkspecs/macx-clang -I/Applications/Xcode.app/Contents/Developer/Platforms/MacOSX.platform/Developer/SDKs/MacOSX10.10.sdk/System/Library/Frameworks/OpenGL.framework/Headers -I/Users/build/Qt/5.4/clang_64/lib/QtWidgets.framework/Headers -I/Users/build/Qt/5.4/clang_64/lib/QtPrintSupport.framework/Headers -I/Users/build/Qt/5.4/clang_64/lib/QtSvg.framework/Headers -I/Users/build/Qt/5.4/clang_64/lib/QtDeclarative.framework/Headers -I/Users/build/Qt/5.4/clang_64/lib/QtScript.framework/Headers -I/Users/build/Qt/5.4/clang_64/lib/QtScriptTools.framework/Headers -I/Users/build/Qt/5.4/clang_64/lib/QtNetwork.framework/Headers -I/Users/build/Qt/5.4/clang_64/lib/QtTest.framework/Headers -I/Users/build/Qt/5.4/clang_64/lib/QtDesigner.framework/Headers -I/Users/build/Qt/5.4/clang_64/lib/QtXml.framework/Headers -I/Users/build/Qt/5.4/clang_64/lib/QtConcurrent.framework/Headers -I/Users/build/Qt/5.4/clang_64/lib/QtXmlPatterns.framework/Headers -I/Users/build/Qt/5.4/clang_64/include -I/Users/build/Qt/5.4/clang_64/include/QtUiTools -I/Users/build/Qt/5.4/clang_64/lib/QtQml.framework/Headers -I/Users/build/Qt/5.4/clang_64/lib/QtQuick.framework/Headers -I/Users/build/Qt/5.4/clang_64/lib/QtQuickWidgets.framework/Headers -I/Users/build/Qt/5.4/clang_64/lib/QtWebKit.framework/Headers -I/Users/build/Qt/5.4/clang_64/lib/QtWebKitWidgets.framework/Headers -I/Users/build/Qt/5.4/clang_64/lib/QtSql.framework/Headers -I/Users/build/Qt/5.4/clang_64/lib/QtOpenGL.framework/Headers -I/Users/build/MuseScore -I/Users/build/MuseScore/build.release -I/usr/local/Cellar/jack/0.124.1/include -I/usr/local/Cellar/portaudio/19.20140130/include -I/usr/local/Cellar/libogg/1.3.2/include -I/usr/local/Cellar/libvorbis/1.3.4/include -I/usr/local/Cellar/libsndfile/1.0.25/include -I/usr/local/include -I/Users/build/MuseScore/build.release/awl/mscore.build/Release/awl.build/DerivedSources/x86_64 -I/Users/build/MuseScore/build.release/awl/mscore.build/Release/awl.build/DerivedSources -Wmost -Wno-four-char-constants -Wno-unknown-pragmas -F/Users/build/MuseScore/build.release/awl/Release -F/Users/build/Qt/5.4/clang_64/lib -std=c++0x -fPIC -stdlib=libc++ -DNDEBUG -DQT_NO_DEBUG -Wall -Wextra -Winvalid-pch -include /var/folders/_p/zg2h1pkn3vx5ngw4dfy7nbcr0000gn/C/com.apple.DeveloperTools/6.1.1-6A2008a/Xcode/SharedPrecompiledHeaders/all-ckqeeqmjhoqfpwcahcuhqhmyqwix/all.h -MMD -MT dependencies -MF /Users/build/MuseScore/build.release/awl/mscore.build/Release/awl.build/Objects-normal/x86_64/utils.d --serialize-diagnostics /Users/build/MuseScore/build.release/awl/mscore.build/Release/awl.build/Objects-normal/x86_64/utils.dia -c /Users/build/MuseScore/awl/utils.cpp -o /Users/build/MuseScore/build.release/awl/mscore.build/Release/awl.build/Objects-normal/x86_64/utils.o

CompileC build.release/awl/mscore.build/Release/awl.build/Objects-normal/x86_64/volknob.o awl/volknob.cpp normal x86_64 c++ com.apple.compilers.llvm.clang.1_0.compiler
    cd /Users/build/MuseScore
    export LANG=en_US.US-ASCII
    /Applications/Xcode.app/Contents/Developer/Toolchains/XcodeDefault.xctoolchain/usr/bin/clang -x c++ -arch x86_64 -fmessage-length=80 -fdiagnostics-show-note-include-stack -fmacro-backtrace-limit=0 -fcolor-diagnostics -Wno-trigraphs -fpascal-strings -O2 -Wno-missing-field-initializers -Wno-missing-prototypes -Wno-return-type -Wno-non-virtual-dtor -Wno-overloaded-virtual -Wno-exit-time-destructors -Wno-missing-braces -Wparentheses -Wswitch -Wno-unused-function -Wno-unused-label -Wno-unused-parameter -Wno-unused-variable -Wunused-value -Wno-empty-body -Wno-uninitialized -Wno-unknown-pragmas -Wno-shadow -Wno-four-char-constants -Wno-conversion -Wno-constant-conversion -Wno-int-conversion -Wno-bool-conversion -Wno-enum-conversion -Wno-shorten-64-to-32 -Wno-newline-eof -Wno-c++11-extensions -DCMAKE_INTDIR=\"Release\" -DQT_DISABLE_DEPRECATED_BEFORE=0 -isysroot /Applications/Xcode.app/Contents/Developer/Platforms/MacOSX.platform/Developer/SDKs/MacOSX10.10.sdk -fasm-blocks -fstrict-aliasing -Wdeprecated-declarations -Winvalid-offsetof -mmacosx-version-min=10.7 -g -Wno-sign-conversion -I/Users/build/MuseScore/build.release/awl/Release/include -I/Users/build/MuseScore/build.release/awl -I/Users/build/MuseScore/awl -I/Users/build/Qt/5.4/clang_64/lib/QtGui.framework/Headers -I/Users/build/Qt/5.4/clang_64/lib/QtCore.framework/Headers -I/Users/build/Qt/5.4/clang_64/mkspecs/macx-clang -I/Applications/Xcode.app/Contents/Developer/Platforms/MacOSX.platform/Developer/SDKs/MacOSX10.10.sdk/System/Library/Frameworks/OpenGL.framework/Headers -I/Users/build/Qt/5.4/clang_64/lib/QtWidgets.framework/Headers -I/Users/build/Qt/5.4/clang_64/lib/QtPrintSupport.framework/Headers -I/Users/build/Qt/5.4/clang_64/lib/QtSvg.framework/Headers -I/Users/build/Qt/5.4/clang_64/lib/QtDeclarative.framework/Headers -I/Users/build/Qt/5.4/clang_64/lib/QtScript.framework/Headers -I/Users/build/Qt/5.4/clang_64/lib/QtScriptTools.framework/Headers -I/Users/build/Qt/5.4/clang_64/lib/QtNetwork.framework/Headers -I/Users/build/Qt/5.4/clang_64/lib/QtTest.framework/Headers -I/Users/build/Qt/5.4/clang_64/lib/QtDesigner.framework/Headers -I/Users/build/Qt/5.4/clang_64/lib/QtXml.framework/Headers -I/Users/build/Qt/5.4/clang_64/lib/QtConcurrent.framework/Headers -I/Users/build/Qt/5.4/clang_64/lib/QtXmlPatterns.framework/Headers -I/Users/build/Qt/5.4/clang_64/include -I/Users/build/Qt/5.4/clang_64/include/QtUiTools -I/Users/build/Qt/5.4/clang_64/lib/QtQml.framework/Headers -I/Users/build/Qt/5.4/clang_64/lib/QtQuick.framework/Headers -I/Users/build/Qt/5.4/clang_64/lib/QtQuickWidgets.framework/Headers -I/Users/build/Qt/5.4/clang_64/lib/QtWebKit.framework/Headers -I/Users/build/Qt/5.4/clang_64/lib/QtWebKitWidgets.framework/Headers -I/Users/build/Qt/5.4/clang_64/lib/QtSql.framework/Headers -I/Users/build/Qt/5.4/clang_64/lib/QtOpenGL.framework/Headers -I/Users/build/MuseScore -I/Users/build/MuseScore/build.release -I/usr/local/Cellar/jack/0.124.1/include -I/usr/local/Cellar/portaudio/19.20140130/include -I/usr/local/Cellar/libogg/1.3.2/include -I/usr/local/Cellar/libvorbis/1.3.4/include -I/usr/local/Cellar/libsndfile/1.0.25/include -I/usr/local/include -I/Users/build/MuseScore/build.release/awl/mscore.build/Release/awl.build/DerivedSources/x86_64 -I/Users/build/MuseScore/build.release/awl/mscore.build/Release/awl.build/DerivedSources -Wmost -Wno-four-char-constants -Wno-unknown-pragmas -F/Users/build/MuseScore/build.release/awl/Release -F/Users/build/Qt/5.4/clang_64/lib -std=c++0x -fPIC -stdlib=libc++ -DNDEBUG -DQT_NO_DEBUG -Wall -Wextra -Winvalid-pch -include /var/folders/_p/zg2h1pkn3vx5ngw4dfy7nbcr0000gn/C/com.apple.DeveloperTools/6.1.1-6A2008a/Xcode/SharedPrecompiledHeaders/all-ckqeeqmjhoqfpwcahcuhqhmyqwix/all.h -MMD -MT dependencies -MF /Users/build/MuseScore/build.release/awl/mscore.build/Release/awl.build/Objects-normal/x86_64/volknob.d --serialize-diagnostics /Users/build/MuseScore/build.release/awl/mscore.build/Release/awl.build/Objects-normal/x86_64/volknob.dia -c /Users/build/MuseScore/awl/volknob.cpp -o /Users/build/MuseScore/build.release/awl/mscore.build/Release/awl.build/Objects-normal/x86_64/volknob.o

CompileC build.release/awl/mscore.build/Release/awl.build/Objects-normal/x86_64/volslider.o awl/volslider.cpp normal x86_64 c++ com.apple.compilers.llvm.clang.1_0.compiler
    cd /Users/build/MuseScore
    export LANG=en_US.US-ASCII
    /Applications/Xcode.app/Contents/Developer/Toolchains/XcodeDefault.xctoolchain/usr/bin/clang -x c++ -arch x86_64 -fmessage-length=80 -fdiagnostics-show-note-include-stack -fmacro-backtrace-limit=0 -fcolor-diagnostics -Wno-trigraphs -fpascal-strings -O2 -Wno-missing-field-initializers -Wno-missing-prototypes -Wno-return-type -Wno-non-virtual-dtor -Wno-overloaded-virtual -Wno-exit-time-destructors -Wno-missing-braces -Wparentheses -Wswitch -Wno-unused-function -Wno-unused-label -Wno-unused-parameter -Wno-unused-variable -Wunused-value -Wno-empty-body -Wno-uninitialized -Wno-unknown-pragmas -Wno-shadow -Wno-four-char-constants -Wno-conversion -Wno-constant-conversion -Wno-int-conversion -Wno-bool-conversion -Wno-enum-conversion -Wno-shorten-64-to-32 -Wno-newline-eof -Wno-c++11-extensions -DCMAKE_INTDIR=\"Release\" -DQT_DISABLE_DEPRECATED_BEFORE=0 -isysroot /Applications/Xcode.app/Contents/Developer/Platforms/MacOSX.platform/Developer/SDKs/MacOSX10.10.sdk -fasm-blocks -fstrict-aliasing -Wdeprecated-declarations -Winvalid-offsetof -mmacosx-version-min=10.7 -g -Wno-sign-conversion -I/Users/build/MuseScore/build.release/awl/Release/include -I/Users/build/MuseScore/build.release/awl -I/Users/build/MuseScore/awl -I/Users/build/Qt/5.4/clang_64/lib/QtGui.framework/Headers -I/Users/build/Qt/5.4/clang_64/lib/QtCore.framework/Headers -I/Users/build/Qt/5.4/clang_64/mkspecs/macx-clang -I/Applications/Xcode.app/Contents/Developer/Platforms/MacOSX.platform/Developer/SDKs/MacOSX10.10.sdk/System/Library/Frameworks/OpenGL.framework/Headers -I/Users/build/Qt/5.4/clang_64/lib/QtWidgets.framework/Headers -I/Users/build/Qt/5.4/clang_64/lib/QtPrintSupport.framework/Headers -I/Users/build/Qt/5.4/clang_64/lib/QtSvg.framework/Headers -I/Users/build/Qt/5.4/clang_64/lib/QtDeclarative.framework/Headers -I/Users/build/Qt/5.4/clang_64/lib/QtScript.framework/Headers -I/Users/build/Qt/5.4/clang_64/lib/QtScriptTools.framework/Headers -I/Users/build/Qt/5.4/clang_64/lib/QtNetwork.framework/Headers -I/Users/build/Qt/5.4/clang_64/lib/QtTest.framework/Headers -I/Users/build/Qt/5.4/clang_64/lib/QtDesigner.framework/Headers -I/Users/build/Qt/5.4/clang_64/lib/QtXml.framework/Headers -I/Users/build/Qt/5.4/clang_64/lib/QtConcurrent.framework/Headers -I/Users/build/Qt/5.4/clang_64/lib/QtXmlPatterns.framework/Headers -I/Users/build/Qt/5.4/clang_64/include -I/Users/build/Qt/5.4/clang_64/include/QtUiTools -I/Users/build/Qt/5.4/clang_64/lib/QtQml.framework/Headers -I/Users/build/Qt/5.4/clang_64/lib/QtQuick.framework/Headers -I/Users/build/Qt/5.4/clang_64/lib/QtQuickWidgets.framework/Headers -I/Users/build/Qt/5.4/clang_64/lib/QtWebKit.framework/Headers -I/Users/build/Qt/5.4/clang_64/lib/QtWebKitWidgets.framework/Headers -I/Users/build/Qt/5.4/clang_64/lib/QtSql.framework/Headers -I/Users/build/Qt/5.4/clang_64/lib/QtOpenGL.framework/Headers -I/Users/build/MuseScore -I/Users/build/MuseScore/build.release -I/usr/local/Cellar/jack/0.124.1/include -I/usr/local/Cellar/portaudio/19.20140130/include -I/usr/local/Cellar/libogg/1.3.2/include -I/usr/local/Cellar/libvorbis/1.3.4/include -I/usr/local/Cellar/libsndfile/1.0.25/include -I/usr/local/include -I/Users/build/MuseScore/build.release/awl/mscore.build/Release/awl.build/DerivedSources/x86_64 -I/Users/build/MuseScore/build.release/awl/mscore.build/Release/awl.build/DerivedSources -Wmost -Wno-four-char-constants -Wno-unknown-pragmas -F/Users/build/MuseScore/build.release/awl/Release -F/Users/build/Qt/5.4/clang_64/lib -std=c++0x -fPIC -stdlib=libc++ -DNDEBUG -DQT_NO_DEBUG -Wall -Wextra -Winvalid-pch -include /var/folders/_p/zg2h1pkn3vx5ngw4dfy7nbcr0000gn/C/com.apple.DeveloperTools/6.1.1-6A2008a/Xcode/SharedPrecompiledHeaders/all-ckqeeqmjhoqfpwcahcuhqhmyqwix/all.h -MMD -MT dependencies -MF /Users/build/MuseScore/build.release/awl/mscore.build/Release/awl.build/Objects-normal/x86_64/volslider.d --serialize-diagnostics /Users/build/MuseScore/build.release/awl/mscore.build/Release/awl.build/Objects-normal/x86_64/volslider.dia -c /Users/build/MuseScore/awl/volslider.cpp -o /Users/build/MuseScore/build.release/awl/mscore.build/Release/awl.build/Objects-normal/x86_64/volslider.o

CompileC build.release/awl/mscore.build/Release/awl.build/Objects-normal/x86_64/awl_automoc.o build.release/awl/awl_automoc.cpp normal x86_64 c++ com.apple.compilers.llvm.clang.1_0.compiler
    cd /Users/build/MuseScore
    export LANG=en_US.US-ASCII
    /Applications/Xcode.app/Contents/Developer/Toolchains/XcodeDefault.xctoolchain/usr/bin/clang -x c++ -arch x86_64 -fmessage-length=80 -fdiagnostics-show-note-include-stack -fmacro-backtrace-limit=0 -fcolor-diagnostics -Wno-trigraphs -fpascal-strings -O2 -Wno-missing-field-initializers -Wno-missing-prototypes -Wno-return-type -Wno-non-virtual-dtor -Wno-overloaded-virtual -Wno-exit-time-destructors -Wno-missing-braces -Wparentheses -Wswitch -Wno-unused-function -Wno-unused-label -Wno-unused-parameter -Wno-unused-variable -Wunused-value -Wno-empty-body -Wno-uninitialized -Wno-unknown-pragmas -Wno-shadow -Wno-four-char-constants -Wno-conversion -Wno-constant-conversion -Wno-int-conversion -Wno-bool-conversion -Wno-enum-conversion -Wno-shorten-64-to-32 -Wno-newline-eof -Wno-c++11-extensions -DCMAKE_INTDIR=\"Release\" -DQT_DISABLE_DEPRECATED_BEFORE=0 -isysroot /Applications/Xcode.app/Contents/Developer/Platforms/MacOSX.platform/Developer/SDKs/MacOSX10.10.sdk -fasm-blocks -fstrict-aliasing -Wdeprecated-declarations -Winvalid-offsetof -mmacosx-version-min=10.7 -g -Wno-sign-conversion -I/Users/build/MuseScore/build.release/awl/Release/include -I/Users/build/MuseScore/build.release/awl -I/Users/build/MuseScore/awl -I/Users/build/Qt/5.4/clang_64/lib/QtGui.framework/Headers -I/Users/build/Qt/5.4/clang_64/lib/QtCore.framework/Headers -I/Users/build/Qt/5.4/clang_64/mkspecs/macx-clang -I/Applications/Xcode.app/Contents/Developer/Platforms/MacOSX.platform/Developer/SDKs/MacOSX10.10.sdk/System/Library/Frameworks/OpenGL.framework/Headers -I/Users/build/Qt/5.4/clang_64/lib/QtWidgets.framework/Headers -I/Users/build/Qt/5.4/clang_64/lib/QtPrintSupport.framework/Headers -I/Users/build/Qt/5.4/clang_64/lib/QtSvg.framework/Headers -I/Users/build/Qt/5.4/clang_64/lib/QtDeclarative.framework/Headers -I/Users/build/Qt/5.4/clang_64/lib/QtScript.framework/Headers -I/Users/build/Qt/5.4/clang_64/lib/QtScriptTools.framework/Headers -I/Users/build/Qt/5.4/clang_64/lib/QtNetwork.framework/Headers -I/Users/build/Qt/5.4/clang_64/lib/QtTest.framework/Headers -I/Users/build/Qt/5.4/clang_64/lib/QtDesigner.framework/Headers -I/Users/build/Qt/5.4/clang_64/lib/QtXml.framework/Headers -I/Users/build/Qt/5.4/clang_64/lib/QtConcurrent.framework/Headers -I/Users/build/Qt/5.4/clang_64/lib/QtXmlPatterns.framework/Headers -I/Users/build/Qt/5.4/clang_64/include -I/Users/build/Qt/5.4/clang_64/include/QtUiTools -I/Users/build/Qt/5.4/clang_64/lib/QtQml.framework/Headers -I/Users/build/Qt/5.4/clang_64/lib/QtQuick.framework/Headers -I/Users/build/Qt/5.4/clang_64/lib/QtQuickWidgets.framework/Headers -I/Users/build/Qt/5.4/clang_64/lib/QtWebKit.framework/Headers -I/Users/build/Qt/5.4/clang_64/lib/QtWebKitWidgets.framework/Headers -I/Users/build/Qt/5.4/clang_64/lib/QtSql.framework/Headers -I/Users/build/Qt/5.4/clang_64/lib/QtOpenGL.framework/Headers -I/Users/build/MuseScore -I/Users/build/MuseScore/build.release -I/usr/local/Cellar/jack/0.124.1/include -I/usr/local/Cellar/portaudio/19.20140130/include -I/usr/local/Cellar/libogg/1.3.2/include -I/usr/local/Cellar/libvorbis/1.3.4/include -I/usr/local/Cellar/libsndfile/1.0.25/include -I/usr/local/include -I/Users/build/MuseScore/build.release/awl/mscore.build/Release/awl.build/DerivedSources/x86_64 -I/Users/build/MuseScore/build.release/awl/mscore.build/Release/awl.build/DerivedSources -Wmost -Wno-four-char-constants -Wno-unknown-pragmas -F/Users/build/MuseScore/build.release/awl/Release -F/Users/build/Qt/5.4/clang_64/lib -std=c++0x -fPIC -stdlib=libc++ -DNDEBUG -DQT_NO_DEBUG -Wall -Wextra -Winvalid-pch -include /var/folders/_p/zg2h1pkn3vx5ngw4dfy7nbcr0000gn/C/com.apple.DeveloperTools/6.1.1-6A2008a/Xcode/SharedPrecompiledHeaders/all-ckqeeqmjhoqfpwcahcuhqhmyqwix/all.h -MMD -MT dependencies -MF /Users/build/MuseScore/build.release/awl/mscore.build/Release/awl.build/Objects-normal/x86_64/awl_automoc.d --serialize-diagnostics /Users/build/MuseScore/build.release/awl/mscore.build/Release/awl.build/Objects-normal/x86_64/awl_automoc.dia -c /Users/build/MuseScore/build.release/awl/awl_automoc.cpp -o /Users/build/MuseScore/build.release/awl/mscore.build/Release/awl.build/Objects-normal/x86_64/awl_automoc.o

Libtool build.release/awl/Release/libawl.a normal x86_64
    cd /Users/build/MuseScore
    export MACOSX_DEPLOYMENT_TARGET=10.7
    /Applications/Xcode.app/Contents/Developer/Toolchains/XcodeDefault.xctoolchain/usr/bin/libtool -static -arch_only x86_64 -syslibroot /Applications/Xcode.app/Contents/Developer/Platforms/MacOSX.platform/Developer/SDKs/MacOSX10.10.sdk -L/Users/build/MuseScore/build.release/awl/Release -filelist /Users/build/MuseScore/build.release/awl/mscore.build/Release/awl.build/Objects-normal/x86_64/awl.LinkFileList -o /Users/build/MuseScore/build.release/awl/Release/libawl.a

=== BUILD AGGREGATE TARGET effects_automoc OF PROJECT mscore WITH CONFIGURATION Release ===

Check dependencies

Write auxiliary files
/bin/mkdir -p /Users/build/MuseScore/build.release/effects/mscore.build/Release/effects_automoc.build
write-file /Users/build/MuseScore/build.release/effects/mscore.build/Release/effects_automoc.build/Script-11AD9A83915F44D3978DA98D.sh
chmod 0755 /Users/build/MuseScore/build.release/effects/mscore.build/Release/effects_automoc.build/Script-11AD9A83915F44D3978DA98D.sh

PhaseScriptExecution CMake\ Rules build.release/effects/mscore.build/Release/effects_automoc.build/Script-11AD9A83915F44D3978DA98D.sh
    cd /Users/build/MuseScore
    /bin/sh -c /Users/build/MuseScore/build.release/effects/mscore.build/Release/effects_automoc.build/Script-11AD9A83915F44D3978DA98D.sh
echo "Automatic moc for target effects"
Automatic moc for target effects
cd /Users/build/MuseScore/build.release/effects && /usr/local/Cellar/cmake/3.1.1_1/bin/cmake -E cmake_autogen /Users/build/MuseScore/build.release/effects/CMakeFiles/effects_automoc.dir/ Release
Generating moc_effect.cpp
Generating moc_effectgui.cpp
Generating moc_freeverb.cpp
Generating moc_noeffect.cpp
Generating moc_noeffectgui.cpp
Generating moc_zita.cpp
Generating moc_zitagui.cpp

=== BUILD TARGET effects OF PROJECT mscore WITH CONFIGURATION Release ===

Check dependencies

Write auxiliary files
/bin/mkdir -p /Users/build/MuseScore/build.release/effects/mscore.build/Release/effects.build/Objects-normal/x86_64
write-file /Users/build/MuseScore/build.release/effects/mscore.build/Release/effects.build/Objects-normal/x86_64/effects.LinkFileList
write-file /Users/build/MuseScore/build.release/effects/mscore.build/Release/effects.build/Script-1645F3D58F1A45D9B80F59DF.sh
chmod 0755 /Users/build/MuseScore/build.release/effects/mscore.build/Release/effects.build/Script-1645F3D58F1A45D9B80F59DF.sh

PhaseScriptExecution CMake\ Rules build.release/effects/mscore.build/Release/effects.build/Script-1645F3D58F1A45D9B80F59DF.sh
    cd /Users/build/MuseScore
    /bin/sh -c /Users/build/MuseScore/build.release/effects/mscore.build/Release/effects.build/Script-1645F3D58F1A45D9B80F59DF.sh
/Users/build/Qt/5.4/clang_64/bin/rcc -name zita -o /Users/build/MuseScore/build.release/effects/qrc_zita.cpp /Users/build/MuseScore/effects/zita1/zita.qrc

ProcessPCH++ /var/folders/_p/zg2h1pkn3vx5ngw4dfy7nbcr0000gn/C/com.apple.DeveloperTools/6.1.1-6A2008a/Xcode/SharedPrecompiledHeaders/all-efkifsdiardraibgtfrkyeunlzvh/all.h.pch build.release/all.h normal x86_64 c++ com.apple.compilers.llvm.clang.1_0.compiler
    cd /Users/build/MuseScore
    export LANG=en_US.US-ASCII
    /Applications/Xcode.app/Contents/Developer/Toolchains/XcodeDefault.xctoolchain/usr/bin/clang -x c++-header -arch x86_64 -fmessage-length=80 -fdiagnostics-show-note-include-stack -fmacro-backtrace-limit=0 -fcolor-diagnostics -Wno-trigraphs -fpascal-strings -O2 -Wno-missing-field-initializers -Wno-missing-prototypes -Wno-return-type -Wno-non-virtual-dtor -Wno-overloaded-virtual -Wno-exit-time-destructors -Wno-missing-braces -Wparentheses -Wswitch -Wno-unused-function -Wno-unused-label -Wno-unused-parameter -Wno-unused-variable -Wunused-value -Wno-empty-body -Wno-uninitialized -Wno-unknown-pragmas -Wno-shadow -Wno-four-char-constants -Wno-conversion -Wno-constant-conversion -Wno-int-conversion -Wno-bool-conversion -Wno-enum-conversion -Wno-shorten-64-to-32 -Wno-newline-eof -Wno-c++11-extensions -DCMAKE_INTDIR=\"Release\" -DQT_DISABLE_DEPRECATED_BEFORE=0 -isysroot /Applications/Xcode.app/Contents/Developer/Platforms/MacOSX.platform/Developer/SDKs/MacOSX10.10.sdk -fasm-blocks -fstrict-aliasing -Wdeprecated-declarations -Winvalid-offsetof -mmacosx-version-min=10.7 -g -Wno-sign-conversion -I/Users/build/MuseScore/build.release/effects/Release/include -I/Users/build/MuseScore/build.release/effects -I/Users/build/MuseScore/effects -I/Users/build/Qt/5.4/clang_64/lib/QtGui.framework/Headers -I/Users/build/Qt/5.4/clang_64/lib/QtCore.framework/Headers -I/Users/build/Qt/5.4/clang_64/mkspecs/macx-clang -I/Applications/Xcode.app/Contents/Developer/Platforms/MacOSX.platform/Developer/SDKs/MacOSX10.10.sdk/System/Library/Frameworks/OpenGL.framework/Headers -I/Users/build/Qt/5.4/clang_64/lib/QtWidgets.framework/Headers -I/Users/build/Qt/5.4/clang_64/lib/QtPrintSupport.framework/Headers -I/Users/build/Qt/5.4/clang_64/lib/QtSvg.framework/Headers -I/Users/build/Qt/5.4/clang_64/lib/QtDeclarative.framework/Headers -I/Users/build/Qt/5.4/clang_64/lib/QtScript.framework/Headers -I/Users/build/Qt/5.4/clang_64/lib/QtScriptTools.framework/Headers -I/Users/build/Qt/5.4/clang_64/lib/QtNetwork.framework/Headers -I/Users/build/Qt/5.4/clang_64/lib/QtTest.framework/Headers -I/Users/build/Qt/5.4/clang_64/lib/QtDesigner.framework/Headers -I/Users/build/Qt/5.4/clang_64/lib/QtXml.framework/Headers -I/Users/build/Qt/5.4/clang_64/lib/QtConcurrent.framework/Headers -I/Users/build/Qt/5.4/clang_64/lib/QtXmlPatterns.framework/Headers -I/Users/build/Qt/5.4/clang_64/include -I/Users/build/Qt/5.4/clang_64/include/QtUiTools -I/Users/build/Qt/5.4/clang_64/lib/QtQml.framework/Headers -I/Users/build/Qt/5.4/clang_64/lib/QtQuick.framework/Headers -I/Users/build/Qt/5.4/clang_64/lib/QtQuickWidgets.framework/Headers -I/Users/build/Qt/5.4/clang_64/lib/QtWebKit.framework/Headers -I/Users/build/Qt/5.4/clang_64/lib/QtWebKitWidgets.framework/Headers -I/Users/build/Qt/5.4/clang_64/lib/QtSql.framework/Headers -I/Users/build/Qt/5.4/clang_64/lib/QtOpenGL.framework/Headers -I/Users/build/MuseScore -I/Users/build/MuseScore/build.release -I/usr/local/Cellar/jack/0.124.1/include -I/usr/local/Cellar/portaudio/19.20140130/include -I/usr/local/Cellar/libogg/1.3.2/include -I/usr/local/Cellar/libvorbis/1.3.4/include -I/usr/local/Cellar/libsndfile/1.0.25/include -I/usr/local/include -I/Users/build/MuseScore/build.release/effects/mscore.build/Release/effects.build/DerivedSources/x86_64 -I/Users/build/MuseScore/build.release/effects/mscore.build/Release/effects.build/DerivedSources -Wmost -Wno-four-char-constants -Wno-unknown-pragmas -F/Users/build/MuseScore/build.release/effects/Release -F/Users/build/Qt/5.4/clang_64/lib -std=c++0x -fPIC -stdlib=libc++ -DNDEBUG -DQT_NO_DEBUG -Wall -Wextra -Winvalid-pch -MD -MT dependencies -MF /var/folders/_p/zg2h1pkn3vx5ngw4dfy7nbcr0000gn/C/com.apple.DeveloperTools/6.1.1-6A2008a/Xcode/SharedPrecompiledHeaders/all-efkifsdiardraibgtfrkyeunlzvh/all.h.d -c /Users/build/MuseScore/build.release/all.h -o /var/folders/_p/zg2h1pkn3vx5ngw4dfy7nbcr0000gn/C/com.apple.DeveloperTools/6.1.1-6A2008a/Xcode/SharedPrecompiledHeaders/all-efkifsdiardraibgtfrkyeunlzvh/all.h.pch --serialize-diagnostics /var/folders/_p/zg2h1pkn3vx5ngw4dfy7nbcr0000gn/C/com.apple.DeveloperTools/6.1.1-6A2008a/Xcode/SharedPrecompiledHeaders/all-efkifsdiardraibgtfrkyeunlzvh/all.h.dia

CompileC build.release/effects/mscore.build/Release/effects.build/Objects-normal/x86_64/effects_automoc.o build.release/effects/effects_automoc.cpp normal x86_64 c++ com.apple.compilers.llvm.clang.1_0.compiler
    cd /Users/build/MuseScore
    export LANG=en_US.US-ASCII
    /Applications/Xcode.app/Contents/Developer/Toolchains/XcodeDefault.xctoolchain/usr/bin/clang -x c++ -arch x86_64 -fmessage-length=80 -fdiagnostics-show-note-include-stack -fmacro-backtrace-limit=0 -fcolor-diagnostics -Wno-trigraphs -fpascal-strings -O2 -Wno-missing-field-initializers -Wno-missing-prototypes -Wno-return-type -Wno-non-virtual-dtor -Wno-overloaded-virtual -Wno-exit-time-destructors -Wno-missing-braces -Wparentheses -Wswitch -Wno-unused-function -Wno-unused-label -Wno-unused-parameter -Wno-unused-variable -Wunused-value -Wno-empty-body -Wno-uninitialized -Wno-unknown-pragmas -Wno-shadow -Wno-four-char-constants -Wno-conversion -Wno-constant-conversion -Wno-int-conversion -Wno-bool-conversion -Wno-enum-conversion -Wno-shorten-64-to-32 -Wno-newline-eof -Wno-c++11-extensions -DCMAKE_INTDIR=\"Release\" -DQT_DISABLE_DEPRECATED_BEFORE=0 -isysroot /Applications/Xcode.app/Contents/Developer/Platforms/MacOSX.platform/Developer/SDKs/MacOSX10.10.sdk -fasm-blocks -fstrict-aliasing -Wdeprecated-declarations -Winvalid-offsetof -mmacosx-version-min=10.7 -g -Wno-sign-conversion -I/Users/build/MuseScore/build.release/effects/Release/include -I/Users/build/MuseScore/build.release/effects -I/Users/build/MuseScore/effects -I/Users/build/Qt/5.4/clang_64/lib/QtGui.framework/Headers -I/Users/build/Qt/5.4/clang_64/lib/QtCore.framework/Headers -I/Users/build/Qt/5.4/clang_64/mkspecs/macx-clang -I/Applications/Xcode.app/Contents/Developer/Platforms/MacOSX.platform/Developer/SDKs/MacOSX10.10.sdk/System/Library/Frameworks/OpenGL.framework/Headers -I/Users/build/Qt/5.4/clang_64/lib/QtWidgets.framework/Headers -I/Users/build/Qt/5.4/clang_64/lib/QtPrintSupport.framework/Headers -I/Users/build/Qt/5.4/clang_64/lib/QtSvg.framework/Headers -I/Users/build/Qt/5.4/clang_64/lib/QtDeclarative.framework/Headers -I/Users/build/Qt/5.4/clang_64/lib/QtScript.framework/Headers -I/Users/build/Qt/5.4/clang_64/lib/QtScriptTools.framework/Headers -I/Users/build/Qt/5.4/clang_64/lib/QtNetwork.framework/Headers -I/Users/build/Qt/5.4/clang_64/lib/QtTest.framework/Headers -I/Users/build/Qt/5.4/clang_64/lib/QtDesigner.framework/Headers -I/Users/build/Qt/5.4/clang_64/lib/QtXml.framework/Headers -I/Users/build/Qt/5.4/clang_64/lib/QtConcurrent.framework/Headers -I/Users/build/Qt/5.4/clang_64/lib/QtXmlPatterns.framework/Headers -I/Users/build/Qt/5.4/clang_64/include -I/Users/build/Qt/5.4/clang_64/include/QtUiTools -I/Users/build/Qt/5.4/clang_64/lib/QtQml.framework/Headers -I/Users/build/Qt/5.4/clang_64/lib/QtQuick.framework/Headers -I/Users/build/Qt/5.4/clang_64/lib/QtQuickWidgets.framework/Headers -I/Users/build/Qt/5.4/clang_64/lib/QtWebKit.framework/Headers -I/Users/build/Qt/5.4/clang_64/lib/QtWebKitWidgets.framework/Headers -I/Users/build/Qt/5.4/clang_64/lib/QtSql.framework/Headers -I/Users/build/Qt/5.4/clang_64/lib/QtOpenGL.framework/Headers -I/Users/build/MuseScore -I/Users/build/MuseScore/build.release -I/usr/local/Cellar/jack/0.124.1/include -I/usr/local/Cellar/portaudio/19.20140130/include -I/usr/local/Cellar/libogg/1.3.2/include -I/usr/local/Cellar/libvorbis/1.3.4/include -I/usr/local/Cellar/libsndfile/1.0.25/include -I/usr/local/include -I/Users/build/MuseScore/build.release/effects/mscore.build/Release/effects.build/DerivedSources/x86_64 -I/Users/build/MuseScore/build.release/effects/mscore.build/Release/effects.build/DerivedSources -Wmost -Wno-four-char-constants -Wno-unknown-pragmas -F/Users/build/MuseScore/build.release/effects/Release -F/Users/build/Qt/5.4/clang_64/lib -std=c++0x -fPIC -stdlib=libc++ -DNDEBUG -DQT_NO_DEBUG -Wall -Wextra -Winvalid-pch -include /var/folders/_p/zg2h1pkn3vx5ngw4dfy7nbcr0000gn/C/com.apple.DeveloperTools/6.1.1-6A2008a/Xcode/SharedPrecompiledHeaders/all-efkifsdiardraibgtfrkyeunlzvh/all.h -MMD -MT dependencies -MF /Users/build/MuseScore/build.release/effects/mscore.build/Release/effects.build/Objects-normal/x86_64/effects_automoc.d --serialize-diagnostics /Users/build/MuseScore/build.release/effects/mscore.build/Release/effects.build/Objects-normal/x86_64/effects_automoc.dia -c /Users/build/MuseScore/build.release/effects/effects_automoc.cpp -o /Users/build/MuseScore/build.release/effects/mscore.build/Release/effects.build/Objects-normal/x86_64/effects_automoc.o
In file included from /Users/build/MuseScore/build.release/effects/effects_automoc.cpp:4:
In file included from /Users/build/MuseScore/build.release/effects/moc_freeverb.cpp:9:
/Users/build/MuseScore/build.release/effects/../../effects/freeverb/freeverb.h:78:25: error:
      unknown class name 'Effect'; did you mean 'Ms::Effect'?
class Freeverb : public Effect {
                        ^~~~~~
                        Ms::Effect
In file included from /Users/build/MuseScore/build.release/effects/effects_automoc.cpp:3:
In file included from /Users/build/MuseScore/build.release/effects/moc_effectgui.cpp:9:
/Users/build/MuseScore/build.release/effects/../../effects/effectgui.h:18:7: note:
      'Ms::Effect' declared here
class Effect;
      ^
In file included from /Users/build/MuseScore/build.release/effects/effects_automoc.cpp:4:
In file included from /Users/build/MuseScore/build.release/effects/moc_freeverb.cpp:9:
/Users/build/MuseScore/build.release/effects/../../effects/freeverb/freeverb.h:103:15: error:
      unknown type name 'EffectGui'; did you mean 'Ms::EffectGui'?
      virtual EffectGui* gui();
              ^~~~~~~~~
              Ms::EffectGui
In file included from /Users/build/MuseScore/build.release/effects/effects_automoc.cpp:3:
In file included from /Users/build/MuseScore/build.release/effects/moc_effectgui.cpp:9:
/Users/build/MuseScore/build.release/effects/../../effects/effectgui.h:24:7: note:
      'Ms::EffectGui' declared here
class EffectGui : public QWidget {
      ^
In file included from /Users/build/MuseScore/build.release/effects/effects_automoc.cpp:4:
In file included from /Users/build/MuseScore/build.release/effects/moc_freeverb.cpp:9:
/Users/build/MuseScore/build.release/effects/../../effects/freeverb/freeverb.h:104:33: error:
      use of undeclared identifier 'ParDescr'; did you mean 'parDescr'?
      virtual const std::vector<ParDescr>& parDescr() const;
                                ^~~~~~~~
                                parDescr
In file included from /Users/build/MuseScore/build.release/effects/effects_automoc.cpp:2:
In file included from /Users/build/MuseScore/build.release/effects/moc_effect.cpp:9:
/Users/build/MuseScore/build.release/effects/../../effects/effect.h:58:44: note:
      'parDescr' declared here
      virtual const std::vector<ParDescr>& parDescr() const = 0;
                                           ^
In file included from /Users/build/MuseScore/build.release/effects/effects_automoc.cpp:4:
In file included from /Users/build/MuseScore/build.release/effects/moc_freeverb.cpp:9:
/Users/build/MuseScore/build.release/effects/../../effects/freeverb/freeverb.h:104:33: error:
      call to non-static member function without an object argument
      virtual const std::vector<ParDescr>& parDescr() const;
                                ^~~~~~~~
4 errors generated.

CompileC build.release/effects/mscore.build/Release/effects.build/Objects-normal/x86_64/qrc_zita.o build.release/effects/qrc_zita.cpp normal x86_64 c++ com.apple.compilers.llvm.clang.1_0.compiler
    cd /Users/build/MuseScore
    export LANG=en_US.US-ASCII
    /Applications/Xcode.app/Contents/Developer/Toolchains/XcodeDefault.xctoolchain/usr/bin/clang -x c++ -arch x86_64 -fmessage-length=80 -fdiagnostics-show-note-include-stack -fmacro-backtrace-limit=0 -fcolor-diagnostics -Wno-trigraphs -fpascal-strings -O2 -Wno-missing-field-initializers -Wno-missing-prototypes -Wno-return-type -Wno-non-virtual-dtor -Wno-overloaded-virtual -Wno-exit-time-destructors -Wno-missing-braces -Wparentheses -Wswitch -Wno-unused-function -Wno-unused-label -Wno-unused-parameter -Wno-unused-variable -Wunused-value -Wno-empty-body -Wno-uninitialized -Wno-unknown-pragmas -Wno-shadow -Wno-four-char-constants -Wno-conversion -Wno-constant-conversion -Wno-int-conversion -Wno-bool-conversion -Wno-enum-conversion -Wno-shorten-64-to-32 -Wno-newline-eof -Wno-c++11-extensions -DCMAKE_INTDIR=\"Release\" -DQT_DISABLE_DEPRECATED_BEFORE=0 -isysroot /Applications/Xcode.app/Contents/Developer/Platforms/MacOSX.platform/Developer/SDKs/MacOSX10.10.sdk -fasm-blocks -fstrict-aliasing -Wdeprecated-declarations -Winvalid-offsetof -mmacosx-version-min=10.7 -g -Wno-sign-conversion -I/Users/build/MuseScore/build.release/effects/Release/include -I/Users/build/MuseScore/build.release/effects -I/Users/build/MuseScore/effects -I/Users/build/Qt/5.4/clang_64/lib/QtGui.framework/Headers -I/Users/build/Qt/5.4/clang_64/lib/QtCore.framework/Headers -I/Users/build/Qt/5.4/clang_64/mkspecs/macx-clang -I/Applications/Xcode.app/Contents/Developer/Platforms/MacOSX.platform/Developer/SDKs/MacOSX10.10.sdk/System/Library/Frameworks/OpenGL.framework/Headers -I/Users/build/Qt/5.4/clang_64/lib/QtWidgets.framework/Headers -I/Users/build/Qt/5.4/clang_64/lib/QtPrintSupport.framework/Headers -I/Users/build/Qt/5.4/clang_64/lib/QtSvg.framework/Headers -I/Users/build/Qt/5.4/clang_64/lib/QtDeclarative.framework/Headers -I/Users/build/Qt/5.4/clang_64/lib/QtScript.framework/Headers -I/Users/build/Qt/5.4/clang_64/lib/QtScriptTools.framework/Headers -I/Users/build/Qt/5.4/clang_64/lib/QtNetwork.framework/Headers -I/Users/build/Qt/5.4/clang_64/lib/QtTest.framework/Headers -I/Users/build/Qt/5.4/clang_64/lib/QtDesigner.framework/Headers -I/Users/build/Qt/5.4/clang_64/lib/QtXml.framework/Headers -I/Users/build/Qt/5.4/clang_64/lib/QtConcurrent.framework/Headers -I/Users/build/Qt/5.4/clang_64/lib/QtXmlPatterns.framework/Headers -I/Users/build/Qt/5.4/clang_64/include -I/Users/build/Qt/5.4/clang_64/include/QtUiTools -I/Users/build/Qt/5.4/clang_64/lib/QtQml.framework/Headers -I/Users/build/Qt/5.4/clang_64/lib/QtQuick.framework/Headers -I/Users/build/Qt/5.4/clang_64/lib/QtQuickWidgets.framework/Headers -I/Users/build/Qt/5.4/clang_64/lib/QtWebKit.framework/Headers -I/Users/build/Qt/5.4/clang_64/lib/QtWebKitWidgets.framework/Headers -I/Users/build/Qt/5.4/clang_64/lib/QtSql.framework/Headers -I/Users/build/Qt/5.4/clang_64/lib/QtOpenGL.framework/Headers -I/Users/build/MuseScore -I/Users/build/MuseScore/build.release -I/usr/local/Cellar/jack/0.124.1/include -I/usr/local/Cellar/portaudio/19.20140130/include -I/usr/local/Cellar/libogg/1.3.2/include -I/usr/local/Cellar/libvorbis/1.3.4/include -I/usr/local/Cellar/libsndfile/1.0.25/include -I/usr/local/include -I/Users/build/MuseScore/build.release/effects/mscore.build/Release/effects.build/DerivedSources/x86_64 -I/Users/build/MuseScore/build.release/effects/mscore.build/Release/effects.build/DerivedSources -Wmost -Wno-four-char-constants -Wno-unknown-pragmas -F/Users/build/MuseScore/build.release/effects/Release -F/Users/build/Qt/5.4/clang_64/lib -std=c++0x -fPIC -stdlib=libc++ -DNDEBUG -DQT_NO_DEBUG -Wall -Wextra -Winvalid-pch -include /var/folders/_p/zg2h1pkn3vx5ngw4dfy7nbcr0000gn/C/com.apple.DeveloperTools/6.1.1-6A2008a/Xcode/SharedPrecompiledHeaders/all-efkifsdiardraibgtfrkyeunlzvh/all.h -MMD -MT dependencies -MF /Users/build/MuseScore/build.release/effects/mscore.build/Release/effects.build/Objects-normal/x86_64/qrc_zita.d --serialize-diagnostics /Users/build/MuseScore/build.release/effects/mscore.build/Release/effects.build/Objects-normal/x86_64/qrc_zita.dia -c /Users/build/MuseScore/build.release/effects/qrc_zita.cpp -o /Users/build/MuseScore/build.release/effects/mscore.build/Release/effects.build/Objects-normal/x86_64/qrc_zita.o

CompileC build.release/effects/mscore.build/Release/effects.build/Objects-normal/x86_64/effect.o effects/effect.cpp normal x86_64 c++ com.apple.compilers.llvm.clang.1_0.compiler
    cd /Users/build/MuseScore
    export LANG=en_US.US-ASCII
    /Applications/Xcode.app/Contents/Developer/Toolchains/XcodeDefault.xctoolchain/usr/bin/clang -x c++ -arch x86_64 -fmessage-length=80 -fdiagnostics-show-note-include-stack -fmacro-backtrace-limit=0 -fcolor-diagnostics -Wno-trigraphs -fpascal-strings -O2 -Wno-missing-field-initializers -Wno-missing-prototypes -Wno-return-type -Wno-non-virtual-dtor -Wno-overloaded-virtual -Wno-exit-time-destructors -Wno-missing-braces -Wparentheses -Wswitch -Wno-unused-function -Wno-unused-label -Wno-unused-parameter -Wno-unused-variable -Wunused-value -Wno-empty-body -Wno-uninitialized -Wno-unknown-pragmas -Wno-shadow -Wno-four-char-constants -Wno-conversion -Wno-constant-conversion -Wno-int-conversion -Wno-bool-conversion -Wno-enum-conversion -Wno-shorten-64-to-32 -Wno-newline-eof -Wno-c++11-extensions -DCMAKE_INTDIR=\"Release\" -DQT_DISABLE_DEPRECATED_BEFORE=0 -isysroot /Applications/Xcode.app/Contents/Developer/Platforms/MacOSX.platform/Developer/SDKs/MacOSX10.10.sdk -fasm-blocks -fstrict-aliasing -Wdeprecated-declarations -Winvalid-offsetof -mmacosx-version-min=10.7 -g -Wno-sign-conversion -I/Users/build/MuseScore/build.release/effects/Release/include -I/Users/build/MuseScore/build.release/effects -I/Users/build/MuseScore/effects -I/Users/build/Qt/5.4/clang_64/lib/QtGui.framework/Headers -I/Users/build/Qt/5.4/clang_64/lib/QtCore.framework/Headers -I/Users/build/Qt/5.4/clang_64/mkspecs/macx-clang -I/Applications/Xcode.app/Contents/Developer/Platforms/MacOSX.platform/Developer/SDKs/MacOSX10.10.sdk/System/Library/Frameworks/OpenGL.framework/Headers -I/Users/build/Qt/5.4/clang_64/lib/QtWidgets.framework/Headers -I/Users/build/Qt/5.4/clang_64/lib/QtPrintSupport.framework/Headers -I/Users/build/Qt/5.4/clang_64/lib/QtSvg.framework/Headers -I/Users/build/Qt/5.4/clang_64/lib/QtDeclarative.framework/Headers -I/Users/build/Qt/5.4/clang_64/lib/QtScript.framework/Headers -I/Users/build/Qt/5.4/clang_64/lib/QtScriptTools.framework/Headers -I/Users/build/Qt/5.4/clang_64/lib/QtNetwork.framework/Headers -I/Users/build/Qt/5.4/clang_64/lib/QtTest.framework/Headers -I/Users/build/Qt/5.4/clang_64/lib/QtDesigner.framework/Headers -I/Users/build/Qt/5.4/clang_64/lib/QtXml.framework/Headers -I/Users/build/Qt/5.4/clang_64/lib/QtConcurrent.framework/Headers -I/Users/build/Qt/5.4/clang_64/lib/QtXmlPatterns.framework/Headers -I/Users/build/Qt/5.4/clang_64/include -I/Users/build/Qt/5.4/clang_64/include/QtUiTools -I/Users/build/Qt/5.4/clang_64/lib/QtQml.framework/Headers -I/Users/build/Qt/5.4/clang_64/lib/QtQuick.framework/Headers -I/Users/build/Qt/5.4/clang_64/lib/QtQuickWidgets.framework/Headers -I/Users/build/Qt/5.4/clang_64/lib/QtWebKit.framework/Headers -I/Users/build/Qt/5.4/clang_64/lib/QtWebKitWidgets.framework/Headers -I/Users/build/Qt/5.4/clang_64/lib/QtSql.framework/Headers -I/Users/build/Qt/5.4/clang_64/lib/QtOpenGL.framework/Headers -I/Users/build/MuseScore -I/Users/build/MuseScore/build.release -I/usr/local/Cellar/jack/0.124.1/include -I/usr/local/Cellar/portaudio/19.20140130/include -I/usr/local/Cellar/libogg/1.3.2/include -I/usr/local/Cellar/libvorbis/1.3.4/include -I/usr/local/Cellar/libsndfile/1.0.25/include -I/usr/local/include -I/Users/build/MuseScore/build.release/effects/mscore.build/Release/effects.build/DerivedSources/x86_64 -I/Users/build/MuseScore/build.release/effects/mscore.build/Release/effects.build/DerivedSources -Wmost -Wno-four-char-constants -Wno-unknown-pragmas -F/Users/build/MuseScore/build.release/effects/Release -F/Users/build/Qt/5.4/clang_64/lib -std=c++0x -fPIC -stdlib=libc++ -DNDEBUG -DQT_NO_DEBUG -Wall -Wextra -Winvalid-pch -include /var/folders/_p/zg2h1pkn3vx5ngw4dfy7nbcr0000gn/C/com.apple.DeveloperTools/6.1.1-6A2008a/Xcode/SharedPrecompiledHeaders/all-efkifsdiardraibgtfrkyeunlzvh/all.h -MMD -MT dependencies -MF /Users/build/MuseScore/build.release/effects/mscore.build/Release/effects.build/Objects-normal/x86_64/effect.d --serialize-diagnostics /Users/build/MuseScore/build.release/effects/mscore.build/Release/effects.build/Objects-normal/x86_64/effect.dia -c /Users/build/MuseScore/effects/effect.cpp -o /Users/build/MuseScore/build.release/effects/mscore.build/Release/effects.build/Objects-normal/x86_64/effect.o

** BUILD FAILED **


The following build commands failed:
        CompileC build.release/effects/mscore.build/Release/effects.build/Objects-normal/x86_64/effects_automoc.o build.release/effects/effects_automoc.cpp normal x86_64 c++ com.apple.compilers.llvm.clang.1_0.compiler
(1 failure)
make: *** [release] Error 65
ssmn-build:MuseScore build$
ABL
Reply | Threaded
Open this post in threaded view
|

Re: MBP osx 10.10 BUILD FAILED

ABL
Since commit https://github.com/musescore/MuseScore/commit/791625fea (2nd February 20:08 CET) compilation on Mac should work again. You can try to rebase on the most recent commit.

Ciao,
ABL