The latest svn version no compile

classic Classic list List threaded Threaded
2 messages Options
Reply | Threaded
Open this post in threaded view
|

The latest svn version no compile

eastir
With the latest revision (today, 1046), when i compile, i have this error

[  4%] Generating moc_qscriptdebuggerlauncher.h
moc: qscriptdebuggerlauncher.h: No such file
make[3]: *** [scriptdebug/moc_qscriptdebuggerlauncher.h] Error 1
make[3]: se sale del directorio `/home/eduardo/mscore/mscore/build'
make[2]: *** [scriptdebug/CMakeFiles/qtscript_debug.dir/all] Error 2
make[2]: *** Se espera a que terminen otras tareas....
[  4%] Building CXX object fluid/CMakeFiles/fluid.dir/chorus.o

and

[  4%] Building CXX object fluid/CMakeFiles/fluid.dir/tuning.o
Linking CXX static library libfluid.a
make[3]: se sale del directorio `/home/eduardo/mscore/mscore/build'
[  4%] Built target fluid
make[2]: se sale del directorio `/home/eduardo/mscore/mscore/build'
make[1]: *** [all] Error 2
make[1]: se sale del directorio `/home/eduardo/mscore/mscore/build'
make: *** [release] Error 2
Reply | Threaded
Open this post in threaded view
|

Re: The latest svn version no compile

lasconic
Administrator
I just compiled mscore r1046 on ubuntu 8.04 without any problem. I compile script bindings and debugger too.
Maybe you should toogle the BUILD_SCRIPT_INTERFACE and BUILD_SCRIPT_DEBUG to true or false ?

Lasconic


2008/7/3 eastir <[hidden email]>:

With the latest revision (today, 1046), when i compile, i have this error

[  4%] Generating moc_qscriptdebuggerlauncher.h
moc: qscriptdebuggerlauncher.h: No such file
make[3]: *** [scriptdebug/moc_qscriptdebuggerlauncher.h] Error 1
make[3]: se sale del directorio `/home/eduardo/mscore/mscore/build'
make[2]: *** [scriptdebug/CMakeFiles/qtscript_debug.dir/all] Error 2
make[2]: *** Se espera a que terminen otras tareas....
[  4%] Building CXX object fluid/CMakeFiles/fluid.dir/chorus.o

and

[  4%] Building CXX object fluid/CMakeFiles/fluid.dir/tuning.o
Linking CXX static library libfluid.a
make[3]: se sale del directorio `/home/eduardo/mscore/mscore/build'
[  4%] Built target fluid
make[2]: se sale del directorio `/home/eduardo/mscore/mscore/build'
make[1]: *** [all] Error 2
make[1]: se sale del directorio `/home/eduardo/mscore/mscore/build'
make: *** [release] Error 2

--
View this message in context: http://www.nabble.com/The-latest-svn-version-no-compile-tp18267163p18267163.html
Sent from the MuseScore Developer mailing list archive at Nabble.com.


-------------------------------------------------------------------------
Sponsored by: SourceForge.net Community Choice Awards: VOTE NOW!
Studies have shown that voting for your favorite open source project,
along with a healthy diet, reduces your potential for chronic lameness
and boredom. Vote Now at http://www.sourceforge.net/community/cca08
_______________________________________________
Mscore-developer mailing list
[hidden email]
https://lists.sourceforge.net/lists/listinfo/mscore-developer


-------------------------------------------------------------------------
Sponsored by: SourceForge.net Community Choice Awards: VOTE NOW!
Studies have shown that voting for your favorite open source project,
along with a healthy diet, reduces your potential for chronic lameness
and boredom. Vote Now at http://www.sourceforge.net/community/cca08
_______________________________________________
Mscore-developer mailing list
[hidden email]
https://lists.sourceforge.net/lists/listinfo/mscore-developer