mscore-0.9.1d: mscore.desktop missing

classic Classic list List threaded Threaded
2 messages Options
Reply | Threaded
Open this post in threaded view
|

mscore-0.9.1d: mscore.desktop missing

Stefan Kölling
I have just tried to compile version 0.9.1d - I got this error:

cd build; make install
make[1]: Entering directory `/usr/src/packages/BUILD/mscore-0.9.1/build'
make[2]: Entering directory `/usr/src/packages/BUILD/mscore-0.9.1/build'
[  6%] Built target awl
[ 14%] Built target awlplugin
[ 19%] Built target fluid
[ 19%] Built target osdabzip
[ 95%] Built target mscore
[ 97%] Built target smf2xml
[100%] Built target xml2smf
make[2]: Leaving directory `/usr/src/packages/BUILD/mscore-0.9.1/build'
Install the project...
-- Install configuration: "RELEASE"
CMake Error: Error in cmake code at
/usr/src/packages/BUILD/mscore-0.9.1/build/cmake_install.cmake:35:
FILE INSTALL cannot find file "/usr/src/packages/BUILD/mscore-0.9.1/build/mscore.desktop" to install.
Current CMake stack:
[1]    /usr/src/packages/BUILD/mscore-0.9.1/build/cmake_install.cmake
make[1]: *** [install] Fehler 255
make[1]: Leaving directory `/usr/src/packages/BUILD/mscore-0.9.1/build'
make: *** [install] Fehler 2
error: Bad exit status from /var/tmp/rpm-tmp.41919 (%install)


-------------------------------------------------------------------------
This SF.net email is sponsored by: Microsoft
Defy all challenges. Microsoft(R) Visual Studio 2008.
http://clk.atdmt.com/MRT/go/vse0120000070mrt/direct/01/
_______________________________________________
Mscore-developer mailing list
[hidden email]
https://lists.sourceforge.net/lists/listinfo/mscore-developer
Reply | Threaded
Open this post in threaded view
|

Re: mscore-0.9.1d: mscore.desktop missing

wschweer
Administrator
there is another bug in the build system:
In mscore/CMakeLists.txt please change line 150 into:

      install( FILES packaging/mscore.desktop DESTINATION share/applications)

Werner

On Donnerstag 24 Januar 2008, Stefan Koelling wrote:

> I have just tried to compile version 0.9.1d - I got this error:
>
> cd build; make install
> make[1]: Entering directory `/usr/src/packages/BUILD/mscore-0.9.1/build'
> make[2]: Entering directory `/usr/src/packages/BUILD/mscore-0.9.1/build'
> [  6%] Built target awl
> [ 14%] Built target awlplugin
> [ 19%] Built target fluid
> [ 19%] Built target osdabzip
> [ 95%] Built target mscore
> [ 97%] Built target smf2xml
> [100%] Built target xml2smf
> make[2]: Leaving directory `/usr/src/packages/BUILD/mscore-0.9.1/build'
> Install the project...
> -- Install configuration: "RELEASE"
> CMake Error: Error in cmake code at
> /usr/src/packages/BUILD/mscore-0.9.1/build/cmake_install.cmake:35:
> FILE INSTALL cannot find file "/usr/src/packages/BUILD/mscore-0.9.1/build/mscore.desktop" to install.
> Current CMake stack:
> [1]    /usr/src/packages/BUILD/mscore-0.9.1/build/cmake_install.cmake
> make[1]: *** [install] Fehler 255
> make[1]: Leaving directory `/usr/src/packages/BUILD/mscore-0.9.1/build'
> make: *** [install] Fehler 2
> error: Bad exit status from /var/tmp/rpm-tmp.41919 (%install)


-------------------------------------------------------------------------
This SF.net email is sponsored by: Microsoft
Defy all challenges. Microsoft(R) Visual Studio 2008.
http://clk.atdmt.com/MRT/go/vse0120000070mrt/direct/01/
_______________________________________________
Mscore-developer mailing list
[hidden email]
https://lists.sourceforge.net/lists/listinfo/mscore-developer